docs.pytest.org

https://docs.pytest.org/en/latest

py:class

Identifier Project Name Version Location Display Name Usage example
_pytest._code.code.ExceptionInfo pytest 0.1.dev424+gcab02e6 reference/reference.html#pytest.ExceptionInfo - :py:class:`_pytest._code.code.ExceptionInfo`
_pytest.cacheprovider.Cache pytest 0.1.dev424+gcab02e6 reference/reference.html#pytest.Cache - :py:class:`_pytest.cacheprovider.Cache`
_pytest.capture.CaptureFixture pytest 0.1.dev424+gcab02e6 reference/reference.html#pytest.CaptureFixture - :py:class:`_pytest.capture.CaptureFixture`
_pytest.config.Config pytest 0.1.dev424+gcab02e6 reference/reference.html#pytest.Config - :py:class:`_pytest.config.Config`
_pytest.config.Config.ArgsSource pytest 0.1.dev424+gcab02e6 reference/reference.html#pytest.Config.ArgsSource - :py:class:`_pytest.config.Config.ArgsSource`
_pytest.config.Config.InvocationParams pytest 0.1.dev424+gcab02e6 reference/reference.html#pytest.Config.InvocationParams - :py:class:`_pytest.config.Config.InvocationParams`
_pytest.config.ExitCode pytest 0.1.dev424+gcab02e6 reference/reference.html#pytest.ExitCode - :py:class:`_pytest.config.ExitCode`
_pytest.config.PytestPluginManager pytest 0.1.dev424+gcab02e6 reference/reference.html#pytest.PytestPluginManager - :py:class:`_pytest.config.PytestPluginManager`
_pytest.config.argparsing.OptionGroup pytest 0.1.dev424+gcab02e6 reference/reference.html#pytest.OptionGroup - :py:class:`_pytest.config.argparsing.OptionGroup`
_pytest.config.argparsing.Parser pytest 0.1.dev424+gcab02e6 reference/reference.html#pytest.Parser - :py:class:`_pytest.config.argparsing.Parser`
_pytest.config.exceptions.UsageError pytest 0.1.dev424+gcab02e6 reference/reference.html#pytest.UsageError - :py:class:`_pytest.config.exceptions.UsageError`
_pytest.fixtures.FixtureDef pytest 0.1.dev424+gcab02e6 reference/reference.html#pytest.fixtures.FixtureDef - :py:class:`_pytest.fixtures.FixtureDef`
_pytest.fixtures.FixtureRequest pytest 0.1.dev424+gcab02e6 reference/reference.html#pytest.FixtureRequest - :py:class:`_pytest.fixtures.FixtureRequest`
_pytest.legacypath.TempdirFactory pytest 0.1.dev424+gcab02e6 reference/reference.html#pytest.TempdirFactory - :py:class:`_pytest.legacypath.TempdirFactory`
_pytest.logging.LogCaptureFixture pytest 0.1.dev424+gcab02e6 reference/reference.html#pytest.LogCaptureFixture - :py:class:`_pytest.logging.LogCaptureFixture`
_pytest.main.Session pytest 0.1.dev424+gcab02e6 reference/reference.html#pytest.Session - :py:class:`_pytest.main.Session`
_pytest.mark.structures.Mark pytest 0.1.dev424+gcab02e6 reference/reference.html#pytest.Mark - :py:class:`_pytest.mark.structures.Mark`
_pytest.mark.structures.MarkDecorator pytest 0.1.dev424+gcab02e6 reference/reference.html#pytest.MarkDecorator - :py:class:`_pytest.mark.structures.MarkDecorator`
_pytest.mark.structures.MarkGenerator pytest 0.1.dev424+gcab02e6 reference/reference.html#pytest.MarkGenerator - :py:class:`_pytest.mark.structures.MarkGenerator`
_pytest.monkeypatch.MonkeyPatch pytest 0.1.dev424+gcab02e6 reference/reference.html#pytest.MonkeyPatch - :py:class:`_pytest.monkeypatch.MonkeyPatch`
_pytest.nodes.Collector pytest 0.1.dev424+gcab02e6 reference/reference.html#pytest.Collector - :py:class:`_pytest.nodes.Collector`
_pytest.nodes.FSCollector pytest 0.1.dev424+gcab02e6 reference/reference.html#pytest.nodes.FSCollector - :py:class:`_pytest.nodes.FSCollector`
_pytest.nodes.File pytest 0.1.dev424+gcab02e6 reference/reference.html#pytest.File - :py:class:`_pytest.nodes.File`
_pytest.nodes.Item pytest 0.1.dev424+gcab02e6 reference/reference.html#pytest.Item - :py:class:`_pytest.nodes.Item`
_pytest.nodes.Node pytest 0.1.dev424+gcab02e6 reference/reference.html#pytest.nodes.Node - :py:class:`_pytest.nodes.Node`
_pytest.pytester.HookRecorder pytest 0.1.dev424+gcab02e6 reference/reference.html#pytest.HookRecorder - :py:class:`_pytest.pytester.HookRecorder`
_pytest.pytester.LineMatcher pytest 0.1.dev424+gcab02e6 reference/reference.html#pytest.LineMatcher - :py:class:`_pytest.pytester.LineMatcher`
_pytest.pytester.Pytester pytest 0.1.dev424+gcab02e6 reference/reference.html#pytest.Pytester - :py:class:`_pytest.pytester.Pytester`
_pytest.pytester.RecordedHookCall pytest 0.1.dev424+gcab02e6 reference/reference.html#pytest.RecordedHookCall - :py:class:`_pytest.pytester.RecordedHookCall`
_pytest.pytester.RunResult pytest 0.1.dev424+gcab02e6 reference/reference.html#pytest.RunResult - :py:class:`_pytest.pytester.RunResult`
_pytest.python.Class pytest 0.1.dev424+gcab02e6 reference/reference.html#pytest.Class - :py:class:`_pytest.python.Class`
_pytest.python.Function pytest 0.1.dev424+gcab02e6 reference/reference.html#pytest.Function - :py:class:`_pytest.python.Function`
_pytest.python.FunctionDefinition pytest 0.1.dev424+gcab02e6 reference/reference.html#pytest.python.FunctionDefinition - :py:class:`_pytest.python.FunctionDefinition`
_pytest.python.Metafunc pytest 0.1.dev424+gcab02e6 reference/reference.html#pytest.Metafunc - :py:class:`_pytest.python.Metafunc`
_pytest.python.Module pytest 0.1.dev424+gcab02e6 reference/reference.html#pytest.Module - :py:class:`_pytest.python.Module`
_pytest.recwarn.WarningsRecorder pytest 0.1.dev424+gcab02e6 reference/reference.html#pytest.WarningsRecorder - :py:class:`_pytest.recwarn.WarningsRecorder`
_pytest.reports.CollectReport pytest 0.1.dev424+gcab02e6 reference/reference.html#pytest.CollectReport - :py:class:`_pytest.reports.CollectReport`
_pytest.reports.TestReport pytest 0.1.dev424+gcab02e6 reference/reference.html#pytest.TestReport - :py:class:`_pytest.reports.TestReport`
_pytest.runner.CallInfo pytest 0.1.dev424+gcab02e6 reference/reference.html#pytest.CallInfo - :py:class:`_pytest.runner.CallInfo`
_pytest.stash.Stash pytest 0.1.dev424+gcab02e6 reference/reference.html#pytest.Stash - :py:class:`_pytest.stash.Stash`
_pytest.stash.StashKey pytest 0.1.dev424+gcab02e6 reference/reference.html#pytest.StashKey - :py:class:`_pytest.stash.StashKey`
_pytest.tmpdir.TempPathFactory pytest 0.1.dev424+gcab02e6 reference/reference.html#pytest.TempPathFactory - :py:class:`_pytest.tmpdir.TempPathFactory`
pytest.Cache pytest 0.1.dev424+gcab02e6 reference/reference.html#pytest.Cache - :py:class:`pytest.Cache`
pytest.CallInfo pytest 0.1.dev424+gcab02e6 reference/reference.html#pytest.CallInfo - :py:class:`pytest.CallInfo`
pytest.CaptureFixture pytest 0.1.dev424+gcab02e6 reference/reference.html#pytest.CaptureFixture - :py:class:`pytest.CaptureFixture`
pytest.Class pytest 0.1.dev424+gcab02e6 reference/reference.html#pytest.Class - :py:class:`pytest.Class`
pytest.CollectReport pytest 0.1.dev424+gcab02e6 reference/reference.html#pytest.CollectReport - :py:class:`pytest.CollectReport`
pytest.Collector pytest 0.1.dev424+gcab02e6 reference/reference.html#pytest.Collector - :py:class:`pytest.Collector`
pytest.Config pytest 0.1.dev424+gcab02e6 reference/reference.html#pytest.Config - :py:class:`pytest.Config`
pytest.Config.ArgsSource pytest 0.1.dev424+gcab02e6 reference/reference.html#pytest.Config.ArgsSource - :py:class:`pytest.Config.ArgsSource`
pytest.Config.InvocationParams pytest 0.1.dev424+gcab02e6 reference/reference.html#pytest.Config.InvocationParams - :py:class:`pytest.Config.InvocationParams`
pytest.ExceptionInfo pytest 0.1.dev424+gcab02e6 reference/reference.html#pytest.ExceptionInfo - :py:class:`pytest.ExceptionInfo`
pytest.ExitCode pytest 0.1.dev424+gcab02e6 reference/reference.html#pytest.ExitCode - :py:class:`pytest.ExitCode`
pytest.File pytest 0.1.dev424+gcab02e6 reference/reference.html#pytest.File - :py:class:`pytest.File`
pytest.FixtureRequest pytest 0.1.dev424+gcab02e6 reference/reference.html#pytest.FixtureRequest - :py:class:`pytest.FixtureRequest`
pytest.Function pytest 0.1.dev424+gcab02e6 reference/reference.html#pytest.Function - :py:class:`pytest.Function`
pytest.HookRecorder pytest 0.1.dev424+gcab02e6 reference/reference.html#pytest.HookRecorder - :py:class:`pytest.HookRecorder`
pytest.Item pytest 0.1.dev424+gcab02e6 reference/reference.html#pytest.Item - :py:class:`pytest.Item`
pytest.LineMatcher pytest 0.1.dev424+gcab02e6 reference/reference.html#pytest.LineMatcher - :py:class:`pytest.LineMatcher`
pytest.LogCaptureFixture pytest 0.1.dev424+gcab02e6 reference/reference.html#pytest.LogCaptureFixture - :py:class:`pytest.LogCaptureFixture`
pytest.Mark pytest 0.1.dev424+gcab02e6 reference/reference.html#pytest.Mark - :py:class:`pytest.Mark`
pytest.MarkDecorator pytest 0.1.dev424+gcab02e6 reference/reference.html#pytest.MarkDecorator - :py:class:`pytest.MarkDecorator`
pytest.MarkGenerator pytest 0.1.dev424+gcab02e6 reference/reference.html#pytest.MarkGenerator - :py:class:`pytest.MarkGenerator`
pytest.Metafunc pytest 0.1.dev424+gcab02e6 reference/reference.html#pytest.Metafunc - :py:class:`pytest.Metafunc`
pytest.Module pytest 0.1.dev424+gcab02e6 reference/reference.html#pytest.Module - :py:class:`pytest.Module`
pytest.MonkeyPatch pytest 0.1.dev424+gcab02e6 reference/reference.html#pytest.MonkeyPatch - :py:class:`pytest.MonkeyPatch`
pytest.OptionGroup pytest 0.1.dev424+gcab02e6 reference/reference.html#pytest.OptionGroup - :py:class:`pytest.OptionGroup`
pytest.Parser pytest 0.1.dev424+gcab02e6 reference/reference.html#pytest.Parser - :py:class:`pytest.Parser`
pytest.PytestAssertRewriteWarning pytest 0.1.dev424+gcab02e6 reference/reference.html#pytest.PytestAssertRewriteWarning - :py:class:`pytest.PytestAssertRewriteWarning`
pytest.PytestCacheWarning pytest 0.1.dev424+gcab02e6 reference/reference.html#pytest.PytestCacheWarning - :py:class:`pytest.PytestCacheWarning`
pytest.PytestCollectionWarning pytest 0.1.dev424+gcab02e6 reference/reference.html#pytest.PytestCollectionWarning - :py:class:`pytest.PytestCollectionWarning`
pytest.PytestConfigWarning pytest 0.1.dev424+gcab02e6 reference/reference.html#pytest.PytestConfigWarning - :py:class:`pytest.PytestConfigWarning`
pytest.PytestDeprecationWarning pytest 0.1.dev424+gcab02e6 reference/reference.html#pytest.PytestDeprecationWarning - :py:class:`pytest.PytestDeprecationWarning`
pytest.PytestExperimentalApiWarning pytest 0.1.dev424+gcab02e6 reference/reference.html#pytest.PytestExperimentalApiWarning - :py:class:`pytest.PytestExperimentalApiWarning`
pytest.PytestPluginManager pytest 0.1.dev424+gcab02e6 reference/reference.html#pytest.PytestPluginManager - :py:class:`pytest.PytestPluginManager`
pytest.PytestRemovedIn8Warning pytest 0.1.dev424+gcab02e6 reference/reference.html#pytest.PytestRemovedIn8Warning - :py:class:`pytest.PytestRemovedIn8Warning`
pytest.PytestReturnNotNoneWarning pytest 0.1.dev424+gcab02e6 reference/reference.html#pytest.PytestReturnNotNoneWarning - :py:class:`pytest.PytestReturnNotNoneWarning`
pytest.PytestUnhandledCoroutineWarning pytest 0.1.dev424+gcab02e6 reference/reference.html#pytest.PytestUnhandledCoroutineWarning - :py:class:`pytest.PytestUnhandledCoroutineWarning`
pytest.PytestUnhandledThreadExceptionWarning pytest 0.1.dev424+gcab02e6 reference/reference.html#pytest.PytestUnhandledThreadExceptionWarning - :py:class:`pytest.PytestUnhandledThreadExceptionWarning`
pytest.PytestUnknownMarkWarning pytest 0.1.dev424+gcab02e6 reference/reference.html#pytest.PytestUnknownMarkWarning - :py:class:`pytest.PytestUnknownMarkWarning`
pytest.PytestUnraisableExceptionWarning pytest 0.1.dev424+gcab02e6 reference/reference.html#pytest.PytestUnraisableExceptionWarning - :py:class:`pytest.PytestUnraisableExceptionWarning`
pytest.PytestWarning pytest 0.1.dev424+gcab02e6 reference/reference.html#pytest.PytestWarning - :py:class:`pytest.PytestWarning`
pytest.Pytester pytest 0.1.dev424+gcab02e6 reference/reference.html#pytest.Pytester - :py:class:`pytest.Pytester`
pytest.RecordedHookCall pytest 0.1.dev424+gcab02e6 reference/reference.html#pytest.RecordedHookCall - :py:class:`pytest.RecordedHookCall`
pytest.RunResult pytest 0.1.dev424+gcab02e6 reference/reference.html#pytest.RunResult - :py:class:`pytest.RunResult`
pytest.Session pytest 0.1.dev424+gcab02e6 reference/reference.html#pytest.Session - :py:class:`pytest.Session`
pytest.Stash pytest 0.1.dev424+gcab02e6 reference/reference.html#pytest.Stash - :py:class:`pytest.Stash`
pytest.StashKey pytest 0.1.dev424+gcab02e6 reference/reference.html#pytest.StashKey - :py:class:`pytest.StashKey`
pytest.TempPathFactory pytest 0.1.dev424+gcab02e6 reference/reference.html#pytest.TempPathFactory - :py:class:`pytest.TempPathFactory`
pytest.TempdirFactory pytest 0.1.dev424+gcab02e6 reference/reference.html#pytest.TempdirFactory - :py:class:`pytest.TempdirFactory`
pytest.TestReport pytest 0.1.dev424+gcab02e6 reference/reference.html#pytest.TestReport - :py:class:`pytest.TestReport`
pytest.UsageError pytest 0.1.dev424+gcab02e6 reference/reference.html#pytest.UsageError - :py:class:`pytest.UsageError`
pytest.WarningsRecorder pytest 0.1.dev424+gcab02e6 reference/reference.html#pytest.WarningsRecorder - :py:class:`pytest.WarningsRecorder`

py:function

Identifier Project Name Version Location Display Name Usage example
_pytest.capture.capfd pytest 0.1.dev424+gcab02e6 reference/reference.html#pytest.capture.capfd - :py:function:`_pytest.capture.capfd`
_pytest.capture.capfdbinary pytest 0.1.dev424+gcab02e6 reference/reference.html#pytest.capture.capfdbinary - :py:function:`_pytest.capture.capfdbinary`
_pytest.capture.capsys pytest 0.1.dev424+gcab02e6 reference/reference.html#pytest.capture.capsys - :py:function:`_pytest.capture.capsys`
_pytest.capture.capsysbinary pytest 0.1.dev424+gcab02e6 reference/reference.html#pytest.capture.capsysbinary - :py:function:`_pytest.capture.capsysbinary`
_pytest.doctest.doctest_namespace pytest 0.1.dev424+gcab02e6 reference/reference.html#pytest.doctest.doctest_namespace - :py:function:`_pytest.doctest.doctest_namespace`
_pytest.fixtures.pytestconfig pytest 0.1.dev424+gcab02e6 reference/reference.html#pytest.fixtures.pytestconfig - :py:function:`_pytest.fixtures.pytestconfig`
_pytest.hookspec.pytest_addhooks pytest 0.1.dev424+gcab02e6 reference/reference.html#pytest.hookspec.pytest_addhooks - :py:function:`_pytest.hookspec.pytest_addhooks`
_pytest.hookspec.pytest_addoption pytest 0.1.dev424+gcab02e6 reference/reference.html#pytest.hookspec.pytest_addoption - :py:function:`_pytest.hookspec.pytest_addoption`
_pytest.hookspec.pytest_assertion_pass pytest 0.1.dev424+gcab02e6 reference/reference.html#pytest.hookspec.pytest_assertion_pass - :py:function:`_pytest.hookspec.pytest_assertion_pass`
_pytest.hookspec.pytest_assertrepr_compare pytest 0.1.dev424+gcab02e6 reference/reference.html#pytest.hookspec.pytest_assertrepr_compare - :py:function:`_pytest.hookspec.pytest_assertrepr_compare`
_pytest.hookspec.pytest_cmdline_main pytest 0.1.dev424+gcab02e6 reference/reference.html#pytest.hookspec.pytest_cmdline_main - :py:function:`_pytest.hookspec.pytest_cmdline_main`
_pytest.hookspec.pytest_cmdline_parse pytest 0.1.dev424+gcab02e6 reference/reference.html#pytest.hookspec.pytest_cmdline_parse - :py:function:`_pytest.hookspec.pytest_cmdline_parse`
_pytest.hookspec.pytest_cmdline_preparse pytest 0.1.dev424+gcab02e6 reference/reference.html#pytest.hookspec.pytest_cmdline_preparse - :py:function:`_pytest.hookspec.pytest_cmdline_preparse`
_pytest.hookspec.pytest_collect_file pytest 0.1.dev424+gcab02e6 reference/reference.html#pytest.hookspec.pytest_collect_file - :py:function:`_pytest.hookspec.pytest_collect_file`
_pytest.hookspec.pytest_collection pytest 0.1.dev424+gcab02e6 reference/reference.html#pytest.hookspec.pytest_collection - :py:function:`_pytest.hookspec.pytest_collection`
_pytest.hookspec.pytest_collection_finish pytest 0.1.dev424+gcab02e6 reference/reference.html#pytest.hookspec.pytest_collection_finish - :py:function:`_pytest.hookspec.pytest_collection_finish`
_pytest.hookspec.pytest_collection_modifyitems pytest 0.1.dev424+gcab02e6 reference/reference.html#pytest.hookspec.pytest_collection_modifyitems - :py:function:`_pytest.hookspec.pytest_collection_modifyitems`
_pytest.hookspec.pytest_collectreport pytest 0.1.dev424+gcab02e6 reference/reference.html#pytest.hookspec.pytest_collectreport - :py:function:`_pytest.hookspec.pytest_collectreport`
_pytest.hookspec.pytest_collectstart pytest 0.1.dev424+gcab02e6 reference/reference.html#pytest.hookspec.pytest_collectstart - :py:function:`_pytest.hookspec.pytest_collectstart`
_pytest.hookspec.pytest_configure pytest 0.1.dev424+gcab02e6 reference/reference.html#pytest.hookspec.pytest_configure - :py:function:`_pytest.hookspec.pytest_configure`
_pytest.hookspec.pytest_deselected pytest 0.1.dev424+gcab02e6 reference/reference.html#pytest.hookspec.pytest_deselected - :py:function:`_pytest.hookspec.pytest_deselected`
_pytest.hookspec.pytest_enter_pdb pytest 0.1.dev424+gcab02e6 reference/reference.html#pytest.hookspec.pytest_enter_pdb - :py:function:`_pytest.hookspec.pytest_enter_pdb`
_pytest.hookspec.pytest_exception_interact pytest 0.1.dev424+gcab02e6 reference/reference.html#pytest.hookspec.pytest_exception_interact - :py:function:`_pytest.hookspec.pytest_exception_interact`
_pytest.hookspec.pytest_fixture_post_finalizer pytest 0.1.dev424+gcab02e6 reference/reference.html#pytest.hookspec.pytest_fixture_post_finalizer - :py:function:`_pytest.hookspec.pytest_fixture_post_finalizer`
_pytest.hookspec.pytest_fixture_setup pytest 0.1.dev424+gcab02e6 reference/reference.html#pytest.hookspec.pytest_fixture_setup - :py:function:`_pytest.hookspec.pytest_fixture_setup`
_pytest.hookspec.pytest_generate_tests pytest 0.1.dev424+gcab02e6 reference/reference.html#pytest.hookspec.pytest_generate_tests - :py:function:`_pytest.hookspec.pytest_generate_tests`
_pytest.hookspec.pytest_ignore_collect pytest 0.1.dev424+gcab02e6 reference/reference.html#pytest.hookspec.pytest_ignore_collect - :py:function:`_pytest.hookspec.pytest_ignore_collect`
_pytest.hookspec.pytest_internalerror pytest 0.1.dev424+gcab02e6 reference/reference.html#pytest.hookspec.pytest_internalerror - :py:function:`_pytest.hookspec.pytest_internalerror`
_pytest.hookspec.pytest_itemcollected pytest 0.1.dev424+gcab02e6 reference/reference.html#pytest.hookspec.pytest_itemcollected - :py:function:`_pytest.hookspec.pytest_itemcollected`
_pytest.hookspec.pytest_keyboard_interrupt pytest 0.1.dev424+gcab02e6 reference/reference.html#pytest.hookspec.pytest_keyboard_interrupt - :py:function:`_pytest.hookspec.pytest_keyboard_interrupt`
_pytest.hookspec.pytest_leave_pdb pytest 0.1.dev424+gcab02e6 reference/reference.html#pytest.hookspec.pytest_leave_pdb - :py:function:`_pytest.hookspec.pytest_leave_pdb`
_pytest.hookspec.pytest_load_initial_conftests pytest 0.1.dev424+gcab02e6 reference/reference.html#pytest.hookspec.pytest_load_initial_conftests - :py:function:`_pytest.hookspec.pytest_load_initial_conftests`
_pytest.hookspec.pytest_make_collect_report pytest 0.1.dev424+gcab02e6 reference/reference.html#pytest.hookspec.pytest_make_collect_report - :py:function:`_pytest.hookspec.pytest_make_collect_report`
_pytest.hookspec.pytest_make_parametrize_id pytest 0.1.dev424+gcab02e6 reference/reference.html#pytest.hookspec.pytest_make_parametrize_id - :py:function:`_pytest.hookspec.pytest_make_parametrize_id`
_pytest.hookspec.pytest_markeval_namespace pytest 0.1.dev424+gcab02e6 reference/reference.html#pytest.hookspec.pytest_markeval_namespace - :py:function:`_pytest.hookspec.pytest_markeval_namespace`
_pytest.hookspec.pytest_plugin_registered pytest 0.1.dev424+gcab02e6 reference/reference.html#pytest.hookspec.pytest_plugin_registered - :py:function:`_pytest.hookspec.pytest_plugin_registered`
_pytest.hookspec.pytest_pycollect_makeitem pytest 0.1.dev424+gcab02e6 reference/reference.html#pytest.hookspec.pytest_pycollect_makeitem - :py:function:`_pytest.hookspec.pytest_pycollect_makeitem`
_pytest.hookspec.pytest_pycollect_makemodule pytest 0.1.dev424+gcab02e6 reference/reference.html#pytest.hookspec.pytest_pycollect_makemodule - :py:function:`_pytest.hookspec.pytest_pycollect_makemodule`
_pytest.hookspec.pytest_pyfunc_call pytest 0.1.dev424+gcab02e6 reference/reference.html#pytest.hookspec.pytest_pyfunc_call - :py:function:`_pytest.hookspec.pytest_pyfunc_call`
_pytest.hookspec.pytest_report_collectionfinish pytest 0.1.dev424+gcab02e6 reference/reference.html#pytest.hookspec.pytest_report_collectionfinish - :py:function:`_pytest.hookspec.pytest_report_collectionfinish`
_pytest.hookspec.pytest_report_from_serializable pytest 0.1.dev424+gcab02e6 reference/reference.html#pytest.hookspec.pytest_report_from_serializable - :py:function:`_pytest.hookspec.pytest_report_from_serializable`
_pytest.hookspec.pytest_report_header pytest 0.1.dev424+gcab02e6 reference/reference.html#pytest.hookspec.pytest_report_header - :py:function:`_pytest.hookspec.pytest_report_header`
_pytest.hookspec.pytest_report_teststatus pytest 0.1.dev424+gcab02e6 reference/reference.html#pytest.hookspec.pytest_report_teststatus - :py:function:`_pytest.hookspec.pytest_report_teststatus`
_pytest.hookspec.pytest_report_to_serializable pytest 0.1.dev424+gcab02e6 reference/reference.html#pytest.hookspec.pytest_report_to_serializable - :py:function:`_pytest.hookspec.pytest_report_to_serializable`
_pytest.hookspec.pytest_runtest_call pytest 0.1.dev424+gcab02e6 reference/reference.html#pytest.hookspec.pytest_runtest_call - :py:function:`_pytest.hookspec.pytest_runtest_call`
_pytest.hookspec.pytest_runtest_logfinish pytest 0.1.dev424+gcab02e6 reference/reference.html#pytest.hookspec.pytest_runtest_logfinish - :py:function:`_pytest.hookspec.pytest_runtest_logfinish`
_pytest.hookspec.pytest_runtest_logreport pytest 0.1.dev424+gcab02e6 reference/reference.html#pytest.hookspec.pytest_runtest_logreport - :py:function:`_pytest.hookspec.pytest_runtest_logreport`
_pytest.hookspec.pytest_runtest_logstart pytest 0.1.dev424+gcab02e6 reference/reference.html#pytest.hookspec.pytest_runtest_logstart - :py:function:`_pytest.hookspec.pytest_runtest_logstart`
_pytest.hookspec.pytest_runtest_makereport pytest 0.1.dev424+gcab02e6 reference/reference.html#pytest.hookspec.pytest_runtest_makereport - :py:function:`_pytest.hookspec.pytest_runtest_makereport`
_pytest.hookspec.pytest_runtest_protocol pytest 0.1.dev424+gcab02e6 reference/reference.html#pytest.hookspec.pytest_runtest_protocol - :py:function:`_pytest.hookspec.pytest_runtest_protocol`
_pytest.hookspec.pytest_runtest_setup pytest 0.1.dev424+gcab02e6 reference/reference.html#pytest.hookspec.pytest_runtest_setup - :py:function:`_pytest.hookspec.pytest_runtest_setup`
_pytest.hookspec.pytest_runtest_teardown pytest 0.1.dev424+gcab02e6 reference/reference.html#pytest.hookspec.pytest_runtest_teardown - :py:function:`_pytest.hookspec.pytest_runtest_teardown`
_pytest.hookspec.pytest_runtestloop pytest 0.1.dev424+gcab02e6 reference/reference.html#pytest.hookspec.pytest_runtestloop - :py:function:`_pytest.hookspec.pytest_runtestloop`
_pytest.hookspec.pytest_sessionfinish pytest 0.1.dev424+gcab02e6 reference/reference.html#pytest.hookspec.pytest_sessionfinish - :py:function:`_pytest.hookspec.pytest_sessionfinish`
_pytest.hookspec.pytest_sessionstart pytest 0.1.dev424+gcab02e6 reference/reference.html#pytest.hookspec.pytest_sessionstart - :py:function:`_pytest.hookspec.pytest_sessionstart`
_pytest.hookspec.pytest_terminal_summary pytest 0.1.dev424+gcab02e6 reference/reference.html#pytest.hookspec.pytest_terminal_summary - :py:function:`_pytest.hookspec.pytest_terminal_summary`
_pytest.hookspec.pytest_unconfigure pytest 0.1.dev424+gcab02e6 reference/reference.html#pytest.hookspec.pytest_unconfigure - :py:function:`_pytest.hookspec.pytest_unconfigure`
_pytest.hookspec.pytest_warning_recorded pytest 0.1.dev424+gcab02e6 reference/reference.html#pytest.hookspec.pytest_warning_recorded - :py:function:`_pytest.hookspec.pytest_warning_recorded`
_pytest.junitxml.record_property pytest 0.1.dev424+gcab02e6 reference/reference.html#pytest.junitxml.record_property - :py:function:`_pytest.junitxml.record_property`
_pytest.junitxml.record_testsuite_property pytest 0.1.dev424+gcab02e6 reference/reference.html#pytest.junitxml.record_testsuite_property - :py:function:`_pytest.junitxml.record_testsuite_property`
_pytest.legacypath.LegacyTmpdirPlugin.tmpdir pytest 0.1.dev424+gcab02e6 reference/reference.html#pytest.legacypath.LegacyTmpdirPlugin.tmpdir - :py:function:`_pytest.legacypath.LegacyTmpdirPlugin.tmpdir`
_pytest.logging.caplog pytest 0.1.dev424+gcab02e6 reference/reference.html#pytest.logging.caplog - :py:function:`_pytest.logging.caplog`
_pytest.monkeypatch.monkeypatch pytest 0.1.dev424+gcab02e6 reference/reference.html#pytest.monkeypatch.monkeypatch - :py:function:`_pytest.monkeypatch.monkeypatch`
_pytest.recwarn.recwarn pytest 0.1.dev424+gcab02e6 reference/reference.html#pytest.recwarn.recwarn - :py:function:`_pytest.recwarn.recwarn`
_pytest.tmpdir.tmp_path pytest 0.1.dev424+gcab02e6 reference/reference.html#pytest.tmpdir.tmp_path - :py:function:`_pytest.tmpdir.tmp_path`
pytest.approx pytest 0.1.dev424+gcab02e6 reference/reference.html#pytest.approx - :py:function:`pytest.approx`
pytest.deprecated_call pytest 0.1.dev424+gcab02e6 reference/reference.html#pytest.deprecated_call - :py:function:`pytest.deprecated_call`
pytest.exit pytest 0.1.dev424+gcab02e6 reference/reference.html#pytest.exit - :py:function:`pytest.exit`
pytest.fail pytest 0.1.dev424+gcab02e6 reference/reference.html#pytest.fail - :py:function:`pytest.fail`
pytest.fixture pytest 0.1.dev424+gcab02e6 reference/reference.html#pytest.fixture - :py:function:`pytest.fixture`
pytest.freeze_includes pytest 0.1.dev424+gcab02e6 reference/reference.html#pytest.freeze_includes - :py:function:`pytest.freeze_includes`
pytest.importorskip pytest 0.1.dev424+gcab02e6 reference/reference.html#pytest.importorskip - :py:function:`pytest.importorskip`
pytest.main pytest 0.1.dev424+gcab02e6 reference/reference.html#pytest.main - :py:function:`pytest.main`
pytest.mark.filterwarnings pytest 0.1.dev424+gcab02e6 reference/reference.html#pytest.mark.filterwarnings - :py:function:`pytest.mark.filterwarnings`
pytest.mark.skip pytest 0.1.dev424+gcab02e6 reference/reference.html#pytest.mark.skip - :py:function:`pytest.mark.skip`
pytest.mark.skipif pytest 0.1.dev424+gcab02e6 reference/reference.html#pytest.mark.skipif - :py:function:`pytest.mark.skipif`
pytest.mark.usefixtures pytest 0.1.dev424+gcab02e6 reference/reference.html#pytest.mark.usefixtures - :py:function:`pytest.mark.usefixtures`
pytest.mark.xfail pytest 0.1.dev424+gcab02e6 reference/reference.html#pytest.mark.xfail - :py:function:`pytest.mark.xfail`
pytest.param pytest 0.1.dev424+gcab02e6 reference/reference.html#pytest.param - :py:function:`pytest.param`
pytest.raises pytest 0.1.dev424+gcab02e6 reference/reference.html#pytest.raises - :py:function:`pytest.raises`
pytest.register_assert_rewrite pytest 0.1.dev424+gcab02e6 reference/reference.html#pytest.register_assert_rewrite - :py:function:`pytest.register_assert_rewrite`
pytest.skip pytest 0.1.dev424+gcab02e6 reference/reference.html#pytest.skip - :py:function:`pytest.skip`
pytest.warns pytest 0.1.dev424+gcab02e6 reference/reference.html#pytest.warns - :py:function:`pytest.warns`
pytest.xfail pytest 0.1.dev424+gcab02e6 reference/reference.html#pytest.xfail - :py:function:`pytest.xfail`

py:property

Identifier Project Name Version Location Display Name Usage example
_pytest.fixtures.FixtureDef.scope pytest 0.1.dev424+gcab02e6 reference/reference.html#pytest.fixtures.FixtureDef.scope - :py:property:`_pytest.fixtures.FixtureDef.scope`
_pytest.nodes.Node.ihook pytest 0.1.dev424+gcab02e6 reference/reference.html#pytest.nodes.Node.ihook - :py:property:`_pytest.nodes.Node.ihook`
_pytest.nodes.Node.nodeid pytest 0.1.dev424+gcab02e6 reference/reference.html#pytest.nodes.Node.nodeid - :py:property:`_pytest.nodes.Node.nodeid`
pytest.CallInfo.result pytest 0.1.dev424+gcab02e6 reference/reference.html#pytest.CallInfo.result - :py:property:`pytest.CallInfo.result`
pytest.CollectReport.caplog pytest 0.1.dev424+gcab02e6 reference/reference.html#pytest.CollectReport.caplog - :py:property:`pytest.CollectReport.caplog`
pytest.CollectReport.capstderr pytest 0.1.dev424+gcab02e6 reference/reference.html#pytest.CollectReport.capstderr - :py:property:`pytest.CollectReport.capstderr`
pytest.CollectReport.capstdout pytest 0.1.dev424+gcab02e6 reference/reference.html#pytest.CollectReport.capstdout - :py:property:`pytest.CollectReport.capstdout`
pytest.CollectReport.count_towards_summary pytest 0.1.dev424+gcab02e6 reference/reference.html#pytest.CollectReport.count_towards_summary - :py:property:`pytest.CollectReport.count_towards_summary`
pytest.CollectReport.failed pytest 0.1.dev424+gcab02e6 reference/reference.html#pytest.CollectReport.failed - :py:property:`pytest.CollectReport.failed`
pytest.CollectReport.fspath pytest 0.1.dev424+gcab02e6 reference/reference.html#pytest.CollectReport.fspath - :py:property:`pytest.CollectReport.fspath`
pytest.CollectReport.head_line pytest 0.1.dev424+gcab02e6 reference/reference.html#pytest.CollectReport.head_line - :py:property:`pytest.CollectReport.head_line`
pytest.CollectReport.longreprtext pytest 0.1.dev424+gcab02e6 reference/reference.html#pytest.CollectReport.longreprtext - :py:property:`pytest.CollectReport.longreprtext`
pytest.CollectReport.passed pytest 0.1.dev424+gcab02e6 reference/reference.html#pytest.CollectReport.passed - :py:property:`pytest.CollectReport.passed`
pytest.CollectReport.skipped pytest 0.1.dev424+gcab02e6 reference/reference.html#pytest.CollectReport.skipped - :py:property:`pytest.CollectReport.skipped`
pytest.Config.inipath pytest 0.1.dev424+gcab02e6 reference/reference.html#pytest.Config.inipath - :py:property:`pytest.Config.inipath`
pytest.Config.rootpath pytest 0.1.dev424+gcab02e6 reference/reference.html#pytest.Config.rootpath - :py:property:`pytest.Config.rootpath`
pytest.ExceptionInfo.tb pytest 0.1.dev424+gcab02e6 reference/reference.html#pytest.ExceptionInfo.tb - :py:property:`pytest.ExceptionInfo.tb`
pytest.ExceptionInfo.traceback pytest 0.1.dev424+gcab02e6 reference/reference.html#pytest.ExceptionInfo.traceback - :py:property:`pytest.ExceptionInfo.traceback`
pytest.ExceptionInfo.type pytest 0.1.dev424+gcab02e6 reference/reference.html#pytest.ExceptionInfo.type - :py:property:`pytest.ExceptionInfo.type`
pytest.ExceptionInfo.typename pytest 0.1.dev424+gcab02e6 reference/reference.html#pytest.ExceptionInfo.typename - :py:property:`pytest.ExceptionInfo.typename`
pytest.ExceptionInfo.value pytest 0.1.dev424+gcab02e6 reference/reference.html#pytest.ExceptionInfo.value - :py:property:`pytest.ExceptionInfo.value`
pytest.FixtureRequest.cls pytest 0.1.dev424+gcab02e6 reference/reference.html#pytest.FixtureRequest.cls - :py:property:`pytest.FixtureRequest.cls`
pytest.FixtureRequest.config pytest 0.1.dev424+gcab02e6 reference/reference.html#pytest.FixtureRequest.config - :py:property:`pytest.FixtureRequest.config`
pytest.FixtureRequest.fixturenames pytest 0.1.dev424+gcab02e6 reference/reference.html#pytest.FixtureRequest.fixturenames - :py:property:`pytest.FixtureRequest.fixturenames`
pytest.FixtureRequest.function pytest 0.1.dev424+gcab02e6 reference/reference.html#pytest.FixtureRequest.function - :py:property:`pytest.FixtureRequest.function`
pytest.FixtureRequest.instance pytest 0.1.dev424+gcab02e6 reference/reference.html#pytest.FixtureRequest.instance - :py:property:`pytest.FixtureRequest.instance`
pytest.FixtureRequest.keywords pytest 0.1.dev424+gcab02e6 reference/reference.html#pytest.FixtureRequest.keywords - :py:property:`pytest.FixtureRequest.keywords`
pytest.FixtureRequest.module pytest 0.1.dev424+gcab02e6 reference/reference.html#pytest.FixtureRequest.module - :py:property:`pytest.FixtureRequest.module`
pytest.FixtureRequest.node pytest 0.1.dev424+gcab02e6 reference/reference.html#pytest.FixtureRequest.node - :py:property:`pytest.FixtureRequest.node`
pytest.FixtureRequest.path pytest 0.1.dev424+gcab02e6 reference/reference.html#pytest.FixtureRequest.path - :py:property:`pytest.FixtureRequest.path`
pytest.FixtureRequest.scope pytest 0.1.dev424+gcab02e6 reference/reference.html#pytest.FixtureRequest.scope - :py:property:`pytest.FixtureRequest.scope`
pytest.FixtureRequest.session pytest 0.1.dev424+gcab02e6 reference/reference.html#pytest.FixtureRequest.session - :py:property:`pytest.FixtureRequest.session`
pytest.Function.function pytest 0.1.dev424+gcab02e6 reference/reference.html#pytest.Function.function - :py:property:`pytest.Function.function`
pytest.LogCaptureFixture.handler pytest 0.1.dev424+gcab02e6 reference/reference.html#pytest.LogCaptureFixture.handler - :py:property:`pytest.LogCaptureFixture.handler`
pytest.LogCaptureFixture.messages pytest 0.1.dev424+gcab02e6 reference/reference.html#pytest.LogCaptureFixture.messages - :py:property:`pytest.LogCaptureFixture.messages`
pytest.LogCaptureFixture.record_tuples pytest 0.1.dev424+gcab02e6 reference/reference.html#pytest.LogCaptureFixture.record_tuples - :py:property:`pytest.LogCaptureFixture.record_tuples`
pytest.LogCaptureFixture.records pytest 0.1.dev424+gcab02e6 reference/reference.html#pytest.LogCaptureFixture.records - :py:property:`pytest.LogCaptureFixture.records`
pytest.LogCaptureFixture.text pytest 0.1.dev424+gcab02e6 reference/reference.html#pytest.LogCaptureFixture.text - :py:property:`pytest.LogCaptureFixture.text`
pytest.MarkDecorator.args pytest 0.1.dev424+gcab02e6 reference/reference.html#pytest.MarkDecorator.args - :py:property:`pytest.MarkDecorator.args`
pytest.MarkDecorator.kwargs pytest 0.1.dev424+gcab02e6 reference/reference.html#pytest.MarkDecorator.kwargs - :py:property:`pytest.MarkDecorator.kwargs`
pytest.MarkDecorator.name pytest 0.1.dev424+gcab02e6 reference/reference.html#pytest.MarkDecorator.name - :py:property:`pytest.MarkDecorator.name`
pytest.Pytester.path pytest 0.1.dev424+gcab02e6 reference/reference.html#pytest.Pytester.path - :py:property:`pytest.Pytester.path`
pytest.Session.startpath pytest 0.1.dev424+gcab02e6 reference/reference.html#pytest.Session.startpath - :py:property:`pytest.Session.startpath`
pytest.TestReport.caplog pytest 0.1.dev424+gcab02e6 reference/reference.html#pytest.TestReport.caplog - :py:property:`pytest.TestReport.caplog`
pytest.TestReport.capstderr pytest 0.1.dev424+gcab02e6 reference/reference.html#pytest.TestReport.capstderr - :py:property:`pytest.TestReport.capstderr`
pytest.TestReport.capstdout pytest 0.1.dev424+gcab02e6 reference/reference.html#pytest.TestReport.capstdout - :py:property:`pytest.TestReport.capstdout`
pytest.TestReport.count_towards_summary pytest 0.1.dev424+gcab02e6 reference/reference.html#pytest.TestReport.count_towards_summary - :py:property:`pytest.TestReport.count_towards_summary`
pytest.TestReport.failed pytest 0.1.dev424+gcab02e6 reference/reference.html#pytest.TestReport.failed - :py:property:`pytest.TestReport.failed`
pytest.TestReport.fspath pytest 0.1.dev424+gcab02e6 reference/reference.html#pytest.TestReport.fspath - :py:property:`pytest.TestReport.fspath`
pytest.TestReport.head_line pytest 0.1.dev424+gcab02e6 reference/reference.html#pytest.TestReport.head_line - :py:property:`pytest.TestReport.head_line`
pytest.TestReport.longreprtext pytest 0.1.dev424+gcab02e6 reference/reference.html#pytest.TestReport.longreprtext - :py:property:`pytest.TestReport.longreprtext`
pytest.TestReport.passed pytest 0.1.dev424+gcab02e6 reference/reference.html#pytest.TestReport.passed - :py:property:`pytest.TestReport.passed`
pytest.TestReport.skipped pytest 0.1.dev424+gcab02e6 reference/reference.html#pytest.TestReport.skipped - :py:property:`pytest.TestReport.skipped`
pytest.WarningsRecorder.list pytest 0.1.dev424+gcab02e6 reference/reference.html#pytest.WarningsRecorder.list - :py:property:`pytest.WarningsRecorder.list`

py:exception

Identifier Project Name Version Location Display Name Usage example
_pytest.main.Failed pytest 0.1.dev424+gcab02e6 reference/reference.html#pytest.Session.Failed - :py:exception:`_pytest.main.Failed`
_pytest.nodes.Collector.CollectError pytest 0.1.dev424+gcab02e6 reference/reference.html#pytest.Collector.CollectError - :py:exception:`_pytest.nodes.Collector.CollectError`
_pytest.pytester.Pytester.TimeoutExpired pytest 0.1.dev424+gcab02e6 reference/reference.html#pytest.Pytester.TimeoutExpired - :py:exception:`_pytest.pytester.Pytester.TimeoutExpired`
builtins.Interrupted pytest 0.1.dev424+gcab02e6 reference/reference.html#pytest.Session.Interrupted - :py:exception:`builtins.Interrupted`
pytest.Collector.CollectError pytest 0.1.dev424+gcab02e6 reference/reference.html#pytest.Collector.CollectError - :py:exception:`pytest.Collector.CollectError`
pytest.Pytester.TimeoutExpired pytest 0.1.dev424+gcab02e6 reference/reference.html#pytest.Pytester.TimeoutExpired - :py:exception:`pytest.Pytester.TimeoutExpired`
pytest.Session.Failed pytest 0.1.dev424+gcab02e6 reference/reference.html#pytest.Session.Failed - :py:exception:`pytest.Session.Failed`
pytest.Session.Interrupted pytest 0.1.dev424+gcab02e6 reference/reference.html#pytest.Session.Interrupted - :py:exception:`pytest.Session.Interrupted`

py:attribute

Identifier Project Name Version Location Display Name Usage example
_pytest.nodes.FSCollector.config pytest 0.1.dev424+gcab02e6 reference/reference.html#pytest.nodes.FSCollector.config - :py:attribute:`_pytest.nodes.FSCollector.config`
_pytest.nodes.FSCollector.extra_keyword_matches pytest 0.1.dev424+gcab02e6 reference/reference.html#pytest.nodes.FSCollector.extra_keyword_matches - :py:attribute:`_pytest.nodes.FSCollector.extra_keyword_matches`
_pytest.nodes.FSCollector.fspath pytest 0.1.dev424+gcab02e6 reference/reference.html#pytest.nodes.FSCollector.fspath - :py:attribute:`_pytest.nodes.FSCollector.fspath`
_pytest.nodes.FSCollector.keywords pytest 0.1.dev424+gcab02e6 reference/reference.html#pytest.nodes.FSCollector.keywords - :py:attribute:`_pytest.nodes.FSCollector.keywords`
_pytest.nodes.FSCollector.name pytest 0.1.dev424+gcab02e6 reference/reference.html#pytest.nodes.FSCollector.name - :py:attribute:`_pytest.nodes.FSCollector.name`
_pytest.nodes.FSCollector.own_markers pytest 0.1.dev424+gcab02e6 reference/reference.html#pytest.nodes.FSCollector.own_markers - :py:attribute:`_pytest.nodes.FSCollector.own_markers`
_pytest.nodes.FSCollector.parent pytest 0.1.dev424+gcab02e6 reference/reference.html#pytest.nodes.FSCollector.parent - :py:attribute:`_pytest.nodes.FSCollector.parent`
_pytest.nodes.FSCollector.path pytest 0.1.dev424+gcab02e6 reference/reference.html#pytest.nodes.FSCollector.path - :py:attribute:`_pytest.nodes.FSCollector.path`
_pytest.nodes.FSCollector.session pytest 0.1.dev424+gcab02e6 reference/reference.html#pytest.nodes.FSCollector.session - :py:attribute:`_pytest.nodes.FSCollector.session`
_pytest.nodes.FSCollector.stash pytest 0.1.dev424+gcab02e6 reference/reference.html#pytest.nodes.FSCollector.stash - :py:attribute:`_pytest.nodes.FSCollector.stash`
_pytest.nodes.Node.config pytest 0.1.dev424+gcab02e6 reference/reference.html#pytest.nodes.Node.config - :py:attribute:`_pytest.nodes.Node.config`
_pytest.nodes.Node.extra_keyword_matches pytest 0.1.dev424+gcab02e6 reference/reference.html#pytest.nodes.Node.extra_keyword_matches - :py:attribute:`_pytest.nodes.Node.extra_keyword_matches`
_pytest.nodes.Node.fspath pytest 0.1.dev424+gcab02e6 reference/reference.html#pytest.nodes.Node.fspath - :py:attribute:`_pytest.nodes.Node.fspath`
_pytest.nodes.Node.keywords pytest 0.1.dev424+gcab02e6 reference/reference.html#pytest.nodes.Node.keywords - :py:attribute:`_pytest.nodes.Node.keywords`
_pytest.nodes.Node.name pytest 0.1.dev424+gcab02e6 reference/reference.html#pytest.nodes.Node.name - :py:attribute:`_pytest.nodes.Node.name`
_pytest.nodes.Node.own_markers pytest 0.1.dev424+gcab02e6 reference/reference.html#pytest.nodes.Node.own_markers - :py:attribute:`_pytest.nodes.Node.own_markers`
_pytest.nodes.Node.parent pytest 0.1.dev424+gcab02e6 reference/reference.html#pytest.nodes.Node.parent - :py:attribute:`_pytest.nodes.Node.parent`
_pytest.nodes.Node.path pytest 0.1.dev424+gcab02e6 reference/reference.html#pytest.nodes.Node.path - :py:attribute:`_pytest.nodes.Node.path`
_pytest.nodes.Node.session pytest 0.1.dev424+gcab02e6 reference/reference.html#pytest.nodes.Node.session - :py:attribute:`_pytest.nodes.Node.session`
_pytest.nodes.Node.stash pytest 0.1.dev424+gcab02e6 reference/reference.html#pytest.nodes.Node.stash - :py:attribute:`_pytest.nodes.Node.stash`
_pytest.python.FunctionDefinition.config pytest 0.1.dev424+gcab02e6 reference/reference.html#pytest.python.FunctionDefinition.config - :py:attribute:`_pytest.python.FunctionDefinition.config`
_pytest.python.FunctionDefinition.extra_keyword_matches pytest 0.1.dev424+gcab02e6 reference/reference.html#pytest.python.FunctionDefinition.extra_keyword_matches - :py:attribute:`_pytest.python.FunctionDefinition.extra_keyword_matches`
_pytest.python.FunctionDefinition.fspath pytest 0.1.dev424+gcab02e6 reference/reference.html#pytest.python.FunctionDefinition.fspath - :py:attribute:`_pytest.python.FunctionDefinition.fspath`
_pytest.python.FunctionDefinition.keywords pytest 0.1.dev424+gcab02e6 reference/reference.html#pytest.python.FunctionDefinition.keywords - :py:attribute:`_pytest.python.FunctionDefinition.keywords`
_pytest.python.FunctionDefinition.name pytest 0.1.dev424+gcab02e6 reference/reference.html#pytest.python.FunctionDefinition.name - :py:attribute:`_pytest.python.FunctionDefinition.name`
_pytest.python.FunctionDefinition.own_markers pytest 0.1.dev424+gcab02e6 reference/reference.html#pytest.python.FunctionDefinition.own_markers - :py:attribute:`_pytest.python.FunctionDefinition.own_markers`
_pytest.python.FunctionDefinition.parent pytest 0.1.dev424+gcab02e6 reference/reference.html#pytest.python.FunctionDefinition.parent - :py:attribute:`_pytest.python.FunctionDefinition.parent`
_pytest.python.FunctionDefinition.path pytest 0.1.dev424+gcab02e6 reference/reference.html#pytest.python.FunctionDefinition.path - :py:attribute:`_pytest.python.FunctionDefinition.path`
_pytest.python.FunctionDefinition.session pytest 0.1.dev424+gcab02e6 reference/reference.html#pytest.python.FunctionDefinition.session - :py:attribute:`_pytest.python.FunctionDefinition.session`
_pytest.python.FunctionDefinition.stash pytest 0.1.dev424+gcab02e6 reference/reference.html#pytest.python.FunctionDefinition.stash - :py:attribute:`_pytest.python.FunctionDefinition.stash`
_pytest.python.FunctionDefinition.user_properties pytest 0.1.dev424+gcab02e6 reference/reference.html#pytest.python.FunctionDefinition.user_properties - :py:attribute:`_pytest.python.FunctionDefinition.user_properties`
pytest.CallInfo.duration pytest 0.1.dev424+gcab02e6 reference/reference.html#pytest.CallInfo.duration - :py:attribute:`pytest.CallInfo.duration`
pytest.CallInfo.excinfo pytest 0.1.dev424+gcab02e6 reference/reference.html#pytest.CallInfo.excinfo - :py:attribute:`pytest.CallInfo.excinfo`
pytest.CallInfo.start pytest 0.1.dev424+gcab02e6 reference/reference.html#pytest.CallInfo.start - :py:attribute:`pytest.CallInfo.start`
pytest.CallInfo.stop pytest 0.1.dev424+gcab02e6 reference/reference.html#pytest.CallInfo.stop - :py:attribute:`pytest.CallInfo.stop`
pytest.CallInfo.when pytest 0.1.dev424+gcab02e6 reference/reference.html#pytest.CallInfo.when - :py:attribute:`pytest.CallInfo.when`
pytest.Class.config pytest 0.1.dev424+gcab02e6 reference/reference.html#pytest.Class.config - :py:attribute:`pytest.Class.config`
pytest.Class.fspath pytest 0.1.dev424+gcab02e6 reference/reference.html#pytest.Class.fspath - :py:attribute:`pytest.Class.fspath`
pytest.Class.name pytest 0.1.dev424+gcab02e6 reference/reference.html#pytest.Class.name - :py:attribute:`pytest.Class.name`
pytest.Class.parent pytest 0.1.dev424+gcab02e6 reference/reference.html#pytest.Class.parent - :py:attribute:`pytest.Class.parent`
pytest.Class.path pytest 0.1.dev424+gcab02e6 reference/reference.html#pytest.Class.path - :py:attribute:`pytest.Class.path`
pytest.Class.session pytest 0.1.dev424+gcab02e6 reference/reference.html#pytest.Class.session - :py:attribute:`pytest.Class.session`
pytest.CollectReport.longrepr pytest 0.1.dev424+gcab02e6 reference/reference.html#pytest.CollectReport.longrepr - :py:attribute:`pytest.CollectReport.longrepr`
pytest.CollectReport.nodeid pytest 0.1.dev424+gcab02e6 reference/reference.html#pytest.CollectReport.nodeid - :py:attribute:`pytest.CollectReport.nodeid`
pytest.CollectReport.outcome pytest 0.1.dev424+gcab02e6 reference/reference.html#pytest.CollectReport.outcome - :py:attribute:`pytest.CollectReport.outcome`
pytest.CollectReport.result pytest 0.1.dev424+gcab02e6 reference/reference.html#pytest.CollectReport.result - :py:attribute:`pytest.CollectReport.result`
pytest.CollectReport.sections pytest 0.1.dev424+gcab02e6 reference/reference.html#pytest.CollectReport.sections - :py:attribute:`pytest.CollectReport.sections`
pytest.Collector.config pytest 0.1.dev424+gcab02e6 reference/reference.html#pytest.Collector.config - :py:attribute:`pytest.Collector.config`
pytest.Collector.fspath pytest 0.1.dev424+gcab02e6 reference/reference.html#pytest.Collector.fspath - :py:attribute:`pytest.Collector.fspath`
pytest.Collector.name pytest 0.1.dev424+gcab02e6 reference/reference.html#pytest.Collector.name - :py:attribute:`pytest.Collector.name`
pytest.Collector.parent pytest 0.1.dev424+gcab02e6 reference/reference.html#pytest.Collector.parent - :py:attribute:`pytest.Collector.parent`
pytest.Collector.path pytest 0.1.dev424+gcab02e6 reference/reference.html#pytest.Collector.path - :py:attribute:`pytest.Collector.path`
pytest.Collector.session pytest 0.1.dev424+gcab02e6 reference/reference.html#pytest.Collector.session - :py:attribute:`pytest.Collector.session`
pytest.Config.ArgsSource.ARGS pytest 0.1.dev424+gcab02e6 reference/reference.html#pytest.Config.ArgsSource.ARGS - :py:attribute:`pytest.Config.ArgsSource.ARGS`
pytest.Config.ArgsSource.INCOVATION_DIR pytest 0.1.dev424+gcab02e6 reference/reference.html#pytest.Config.ArgsSource.INCOVATION_DIR - :py:attribute:`pytest.Config.ArgsSource.INCOVATION_DIR`
pytest.Config.ArgsSource.TESTPATHS pytest 0.1.dev424+gcab02e6 reference/reference.html#pytest.Config.ArgsSource.TESTPATHS - :py:attribute:`pytest.Config.ArgsSource.TESTPATHS`
pytest.Config.InvocationParams.args pytest 0.1.dev424+gcab02e6 reference/reference.html#pytest.Config.InvocationParams.args - :py:attribute:`pytest.Config.InvocationParams.args`
pytest.Config.InvocationParams.dir pytest 0.1.dev424+gcab02e6 reference/reference.html#pytest.Config.InvocationParams.dir - :py:attribute:`pytest.Config.InvocationParams.dir`
pytest.Config.InvocationParams.plugins pytest 0.1.dev424+gcab02e6 reference/reference.html#pytest.Config.InvocationParams.plugins - :py:attribute:`pytest.Config.InvocationParams.plugins`
pytest.Config.invocation_params pytest 0.1.dev424+gcab02e6 reference/reference.html#pytest.Config.invocation_params - :py:attribute:`pytest.Config.invocation_params`
pytest.Config.option pytest 0.1.dev424+gcab02e6 reference/reference.html#pytest.Config.option - :py:attribute:`pytest.Config.option`
pytest.Config.pluginmanager pytest 0.1.dev424+gcab02e6 reference/reference.html#pytest.Config.pluginmanager - :py:attribute:`pytest.Config.pluginmanager`
pytest.Config.stash pytest 0.1.dev424+gcab02e6 reference/reference.html#pytest.Config.stash - :py:attribute:`pytest.Config.stash`
pytest.ExitCode.INTERNAL_ERROR pytest 0.1.dev424+gcab02e6 reference/reference.html#pytest.ExitCode.INTERNAL_ERROR - :py:attribute:`pytest.ExitCode.INTERNAL_ERROR`
pytest.ExitCode.INTERRUPTED pytest 0.1.dev424+gcab02e6 reference/reference.html#pytest.ExitCode.INTERRUPTED - :py:attribute:`pytest.ExitCode.INTERRUPTED`
pytest.ExitCode.NO_TESTS_COLLECTED pytest 0.1.dev424+gcab02e6 reference/reference.html#pytest.ExitCode.NO_TESTS_COLLECTED - :py:attribute:`pytest.ExitCode.NO_TESTS_COLLECTED`
pytest.ExitCode.OK pytest 0.1.dev424+gcab02e6 reference/reference.html#pytest.ExitCode.OK - :py:attribute:`pytest.ExitCode.OK`
pytest.ExitCode.TESTS_FAILED pytest 0.1.dev424+gcab02e6 reference/reference.html#pytest.ExitCode.TESTS_FAILED - :py:attribute:`pytest.ExitCode.TESTS_FAILED`
pytest.ExitCode.USAGE_ERROR pytest 0.1.dev424+gcab02e6 reference/reference.html#pytest.ExitCode.USAGE_ERROR - :py:attribute:`pytest.ExitCode.USAGE_ERROR`
pytest.File.config pytest 0.1.dev424+gcab02e6 reference/reference.html#pytest.File.config - :py:attribute:`pytest.File.config`
pytest.File.extra_keyword_matches pytest 0.1.dev424+gcab02e6 reference/reference.html#pytest.File.extra_keyword_matches - :py:attribute:`pytest.File.extra_keyword_matches`
pytest.File.fspath pytest 0.1.dev424+gcab02e6 reference/reference.html#pytest.File.fspath - :py:attribute:`pytest.File.fspath`
pytest.File.keywords pytest 0.1.dev424+gcab02e6 reference/reference.html#pytest.File.keywords - :py:attribute:`pytest.File.keywords`
pytest.File.name pytest 0.1.dev424+gcab02e6 reference/reference.html#pytest.File.name - :py:attribute:`pytest.File.name`
pytest.File.own_markers pytest 0.1.dev424+gcab02e6 reference/reference.html#pytest.File.own_markers - :py:attribute:`pytest.File.own_markers`
pytest.File.parent pytest 0.1.dev424+gcab02e6 reference/reference.html#pytest.File.parent - :py:attribute:`pytest.File.parent`
pytest.File.path pytest 0.1.dev424+gcab02e6 reference/reference.html#pytest.File.path - :py:attribute:`pytest.File.path`
pytest.File.session pytest 0.1.dev424+gcab02e6 reference/reference.html#pytest.File.session - :py:attribute:`pytest.File.session`
pytest.File.stash pytest 0.1.dev424+gcab02e6 reference/reference.html#pytest.File.stash - :py:attribute:`pytest.File.stash`
pytest.FixtureRequest.fixturename pytest 0.1.dev424+gcab02e6 reference/reference.html#pytest.FixtureRequest.fixturename - :py:attribute:`pytest.FixtureRequest.fixturename`
pytest.Function.config pytest 0.1.dev424+gcab02e6 reference/reference.html#pytest.Function.config - :py:attribute:`pytest.Function.config`
pytest.Function.fspath pytest 0.1.dev424+gcab02e6 reference/reference.html#pytest.Function.fspath - :py:attribute:`pytest.Function.fspath`
pytest.Function.name pytest 0.1.dev424+gcab02e6 reference/reference.html#pytest.Function.name - :py:attribute:`pytest.Function.name`
pytest.Function.originalname pytest 0.1.dev424+gcab02e6 reference/reference.html#pytest.Function.originalname - :py:attribute:`pytest.Function.originalname`
pytest.Function.parent pytest 0.1.dev424+gcab02e6 reference/reference.html#pytest.Function.parent - :py:attribute:`pytest.Function.parent`
pytest.Function.path pytest 0.1.dev424+gcab02e6 reference/reference.html#pytest.Function.path - :py:attribute:`pytest.Function.path`
pytest.Function.session pytest 0.1.dev424+gcab02e6 reference/reference.html#pytest.Function.session - :py:attribute:`pytest.Function.session`
pytest.Item.config pytest 0.1.dev424+gcab02e6 reference/reference.html#pytest.Item.config - :py:attribute:`pytest.Item.config`
pytest.Item.fspath pytest 0.1.dev424+gcab02e6 reference/reference.html#pytest.Item.fspath - :py:attribute:`pytest.Item.fspath`
pytest.Item.name pytest 0.1.dev424+gcab02e6 reference/reference.html#pytest.Item.name - :py:attribute:`pytest.Item.name`
pytest.Item.parent pytest 0.1.dev424+gcab02e6 reference/reference.html#pytest.Item.parent - :py:attribute:`pytest.Item.parent`
pytest.Item.path pytest 0.1.dev424+gcab02e6 reference/reference.html#pytest.Item.path - :py:attribute:`pytest.Item.path`
pytest.Item.session pytest 0.1.dev424+gcab02e6 reference/reference.html#pytest.Item.session - :py:attribute:`pytest.Item.session`
pytest.Item.user_properties pytest 0.1.dev424+gcab02e6 reference/reference.html#pytest.Item.user_properties - :py:attribute:`pytest.Item.user_properties`
pytest.Mark.args pytest 0.1.dev424+gcab02e6 reference/reference.html#pytest.Mark.args - :py:attribute:`pytest.Mark.args`
pytest.Mark.kwargs pytest 0.1.dev424+gcab02e6 reference/reference.html#pytest.Mark.kwargs - :py:attribute:`pytest.Mark.kwargs`
pytest.Mark.name pytest 0.1.dev424+gcab02e6 reference/reference.html#pytest.Mark.name - :py:attribute:`pytest.Mark.name`
pytest.Metafunc.cls pytest 0.1.dev424+gcab02e6 reference/reference.html#pytest.Metafunc.cls - :py:attribute:`pytest.Metafunc.cls`
pytest.Metafunc.config pytest 0.1.dev424+gcab02e6 reference/reference.html#pytest.Metafunc.config - :py:attribute:`pytest.Metafunc.config`
pytest.Metafunc.definition pytest 0.1.dev424+gcab02e6 reference/reference.html#pytest.Metafunc.definition - :py:attribute:`pytest.Metafunc.definition`
pytest.Metafunc.fixturenames pytest 0.1.dev424+gcab02e6 reference/reference.html#pytest.Metafunc.fixturenames - :py:attribute:`pytest.Metafunc.fixturenames`
pytest.Metafunc.function pytest 0.1.dev424+gcab02e6 reference/reference.html#pytest.Metafunc.function - :py:attribute:`pytest.Metafunc.function`
pytest.Metafunc.module pytest 0.1.dev424+gcab02e6 reference/reference.html#pytest.Metafunc.module - :py:attribute:`pytest.Metafunc.module`
pytest.Module.config pytest 0.1.dev424+gcab02e6 reference/reference.html#pytest.Module.config - :py:attribute:`pytest.Module.config`
pytest.Module.extra_keyword_matches pytest 0.1.dev424+gcab02e6 reference/reference.html#pytest.Module.extra_keyword_matches - :py:attribute:`pytest.Module.extra_keyword_matches`
pytest.Module.fspath pytest 0.1.dev424+gcab02e6 reference/reference.html#pytest.Module.fspath - :py:attribute:`pytest.Module.fspath`
pytest.Module.keywords pytest 0.1.dev424+gcab02e6 reference/reference.html#pytest.Module.keywords - :py:attribute:`pytest.Module.keywords`
pytest.Module.name pytest 0.1.dev424+gcab02e6 reference/reference.html#pytest.Module.name - :py:attribute:`pytest.Module.name`
pytest.Module.own_markers pytest 0.1.dev424+gcab02e6 reference/reference.html#pytest.Module.own_markers - :py:attribute:`pytest.Module.own_markers`
pytest.Module.parent pytest 0.1.dev424+gcab02e6 reference/reference.html#pytest.Module.parent - :py:attribute:`pytest.Module.parent`
pytest.Module.path pytest 0.1.dev424+gcab02e6 reference/reference.html#pytest.Module.path - :py:attribute:`pytest.Module.path`
pytest.Module.session pytest 0.1.dev424+gcab02e6 reference/reference.html#pytest.Module.session - :py:attribute:`pytest.Module.session`
pytest.Module.stash pytest 0.1.dev424+gcab02e6 reference/reference.html#pytest.Module.stash - :py:attribute:`pytest.Module.stash`
pytest.Pytester.plugins pytest 0.1.dev424+gcab02e6 reference/reference.html#pytest.Pytester.plugins - :py:attribute:`pytest.Pytester.plugins`
pytest.RunResult.duration pytest 0.1.dev424+gcab02e6 reference/reference.html#pytest.RunResult.duration - :py:attribute:`pytest.RunResult.duration`
pytest.RunResult.errlines pytest 0.1.dev424+gcab02e6 reference/reference.html#pytest.RunResult.errlines - :py:attribute:`pytest.RunResult.errlines`
pytest.RunResult.outlines pytest 0.1.dev424+gcab02e6 reference/reference.html#pytest.RunResult.outlines - :py:attribute:`pytest.RunResult.outlines`
pytest.RunResult.ret pytest 0.1.dev424+gcab02e6 reference/reference.html#pytest.RunResult.ret - :py:attribute:`pytest.RunResult.ret`
pytest.RunResult.stderr pytest 0.1.dev424+gcab02e6 reference/reference.html#pytest.RunResult.stderr - :py:attribute:`pytest.RunResult.stderr`
pytest.RunResult.stdout pytest 0.1.dev424+gcab02e6 reference/reference.html#pytest.RunResult.stdout - :py:attribute:`pytest.RunResult.stdout`
pytest.Session.config pytest 0.1.dev424+gcab02e6 reference/reference.html#pytest.Session.config - :py:attribute:`pytest.Session.config`
pytest.Session.name pytest 0.1.dev424+gcab02e6 reference/reference.html#pytest.Session.name - :py:attribute:`pytest.Session.name`
pytest.Session.parent pytest 0.1.dev424+gcab02e6 reference/reference.html#pytest.Session.parent - :py:attribute:`pytest.Session.parent`
pytest.Session.path pytest 0.1.dev424+gcab02e6 reference/reference.html#pytest.Session.path - :py:attribute:`pytest.Session.path`
pytest.Session.session pytest 0.1.dev424+gcab02e6 reference/reference.html#pytest.Session.session - :py:attribute:`pytest.Session.session`
pytest.TestReport.duration pytest 0.1.dev424+gcab02e6 reference/reference.html#pytest.TestReport.duration - :py:attribute:`pytest.TestReport.duration`
pytest.TestReport.keywords pytest 0.1.dev424+gcab02e6 reference/reference.html#pytest.TestReport.keywords - :py:attribute:`pytest.TestReport.keywords`
pytest.TestReport.location pytest 0.1.dev424+gcab02e6 reference/reference.html#pytest.TestReport.location - :py:attribute:`pytest.TestReport.location`
pytest.TestReport.longrepr pytest 0.1.dev424+gcab02e6 reference/reference.html#pytest.TestReport.longrepr - :py:attribute:`pytest.TestReport.longrepr`
pytest.TestReport.nodeid pytest 0.1.dev424+gcab02e6 reference/reference.html#pytest.TestReport.nodeid - :py:attribute:`pytest.TestReport.nodeid`
pytest.TestReport.outcome pytest 0.1.dev424+gcab02e6 reference/reference.html#pytest.TestReport.outcome - :py:attribute:`pytest.TestReport.outcome`
pytest.TestReport.sections pytest 0.1.dev424+gcab02e6 reference/reference.html#pytest.TestReport.sections - :py:attribute:`pytest.TestReport.sections`
pytest.TestReport.user_properties pytest 0.1.dev424+gcab02e6 reference/reference.html#pytest.TestReport.user_properties - :py:attribute:`pytest.TestReport.user_properties`
pytest.TestReport.when pytest 0.1.dev424+gcab02e6 reference/reference.html#pytest.TestReport.when - :py:attribute:`pytest.TestReport.when`

py:method

Identifier Project Name Version Location Display Name Usage example
_pytest.nodes.FSCollector.from_parent pytest 0.1.dev424+gcab02e6 reference/reference.html#pytest.nodes.FSCollector.from_parent - :py:method:`_pytest.nodes.FSCollector.from_parent`
_pytest.nodes.Node.add_marker pytest 0.1.dev424+gcab02e6 reference/reference.html#pytest.nodes.Node.add_marker - :py:method:`_pytest.nodes.Node.add_marker`
_pytest.nodes.Node.addfinalizer pytest 0.1.dev424+gcab02e6 reference/reference.html#pytest.nodes.Node.addfinalizer - :py:method:`_pytest.nodes.Node.addfinalizer`
_pytest.nodes.Node.from_parent pytest 0.1.dev424+gcab02e6 reference/reference.html#pytest.nodes.Node.from_parent - :py:method:`_pytest.nodes.Node.from_parent`
_pytest.nodes.Node.get_closest_marker pytest 0.1.dev424+gcab02e6 reference/reference.html#pytest.nodes.Node.get_closest_marker - :py:method:`_pytest.nodes.Node.get_closest_marker`
_pytest.nodes.Node.getparent pytest 0.1.dev424+gcab02e6 reference/reference.html#pytest.nodes.Node.getparent - :py:method:`_pytest.nodes.Node.getparent`
_pytest.nodes.Node.iter_markers pytest 0.1.dev424+gcab02e6 reference/reference.html#pytest.nodes.Node.iter_markers - :py:method:`_pytest.nodes.Node.iter_markers`
_pytest.nodes.Node.iter_markers_with_node pytest 0.1.dev424+gcab02e6 reference/reference.html#pytest.nodes.Node.iter_markers_with_node - :py:method:`_pytest.nodes.Node.iter_markers_with_node`
_pytest.nodes.Node.listchain pytest 0.1.dev424+gcab02e6 reference/reference.html#pytest.nodes.Node.listchain - :py:method:`_pytest.nodes.Node.listchain`
_pytest.nodes.Node.listextrakeywords pytest 0.1.dev424+gcab02e6 reference/reference.html#pytest.nodes.Node.listextrakeywords - :py:method:`_pytest.nodes.Node.listextrakeywords`
_pytest.nodes.Node.repr_failure pytest 0.1.dev424+gcab02e6 reference/reference.html#pytest.nodes.Node.repr_failure - :py:method:`_pytest.nodes.Node.repr_failure`
_pytest.nodes.Node.warn pytest 0.1.dev424+gcab02e6 reference/reference.html#pytest.nodes.Node.warn - :py:method:`_pytest.nodes.Node.warn`
_pytest.python.FunctionDefinition.runtest pytest 0.1.dev424+gcab02e6 reference/reference.html#pytest.python.FunctionDefinition.runtest - :py:method:`_pytest.python.FunctionDefinition.runtest`
_pytest.python.FunctionDefinition.setup pytest 0.1.dev424+gcab02e6 reference/reference.html#pytest.python.FunctionDefinition.setup - :py:method:`_pytest.python.FunctionDefinition.setup`
pytest.Cache.get pytest 0.1.dev424+gcab02e6 reference/reference.html#pytest.Cache.get - :py:method:`pytest.Cache.get`
pytest.Cache.mkdir pytest 0.1.dev424+gcab02e6 reference/reference.html#pytest.Cache.mkdir - :py:method:`pytest.Cache.mkdir`
pytest.Cache.set pytest 0.1.dev424+gcab02e6 reference/reference.html#pytest.Cache.set - :py:method:`pytest.Cache.set`
pytest.CallInfo.from_call pytest 0.1.dev424+gcab02e6 reference/reference.html#pytest.CallInfo.from_call - :py:method:`pytest.CallInfo.from_call`
pytest.CaptureFixture.disabled pytest 0.1.dev424+gcab02e6 reference/reference.html#pytest.CaptureFixture.disabled - :py:method:`pytest.CaptureFixture.disabled`
pytest.CaptureFixture.readouterr pytest 0.1.dev424+gcab02e6 reference/reference.html#pytest.CaptureFixture.readouterr - :py:method:`pytest.CaptureFixture.readouterr`
pytest.Class.collect pytest 0.1.dev424+gcab02e6 reference/reference.html#pytest.Class.collect - :py:method:`pytest.Class.collect`
pytest.Class.from_parent pytest 0.1.dev424+gcab02e6 reference/reference.html#pytest.Class.from_parent - :py:method:`pytest.Class.from_parent`
pytest.Collector.collect pytest 0.1.dev424+gcab02e6 reference/reference.html#pytest.Collector.collect - :py:method:`pytest.Collector.collect`
pytest.Collector.repr_failure pytest 0.1.dev424+gcab02e6 reference/reference.html#pytest.Collector.repr_failure - :py:method:`pytest.Collector.repr_failure`
pytest.Config.add_cleanup pytest 0.1.dev424+gcab02e6 reference/reference.html#pytest.Config.add_cleanup - :py:method:`pytest.Config.add_cleanup`
pytest.Config.addinivalue_line pytest 0.1.dev424+gcab02e6 reference/reference.html#pytest.Config.addinivalue_line - :py:method:`pytest.Config.addinivalue_line`
pytest.Config.fromdictargs pytest 0.1.dev424+gcab02e6 reference/reference.html#pytest.Config.fromdictargs - :py:method:`pytest.Config.fromdictargs`
pytest.Config.getini pytest 0.1.dev424+gcab02e6 reference/reference.html#pytest.Config.getini - :py:method:`pytest.Config.getini`
pytest.Config.getoption pytest 0.1.dev424+gcab02e6 reference/reference.html#pytest.Config.getoption - :py:method:`pytest.Config.getoption`
pytest.Config.getvalue pytest 0.1.dev424+gcab02e6 reference/reference.html#pytest.Config.getvalue - :py:method:`pytest.Config.getvalue`
pytest.Config.getvalueorskip pytest 0.1.dev424+gcab02e6 reference/reference.html#pytest.Config.getvalueorskip - :py:method:`pytest.Config.getvalueorskip`
pytest.Config.issue_config_time_warning pytest 0.1.dev424+gcab02e6 reference/reference.html#pytest.Config.issue_config_time_warning - :py:method:`pytest.Config.issue_config_time_warning`
pytest.ExceptionInfo.errisinstance pytest 0.1.dev424+gcab02e6 reference/reference.html#pytest.ExceptionInfo.errisinstance - :py:method:`pytest.ExceptionInfo.errisinstance`
pytest.ExceptionInfo.exconly pytest 0.1.dev424+gcab02e6 reference/reference.html#pytest.ExceptionInfo.exconly - :py:method:`pytest.ExceptionInfo.exconly`
pytest.ExceptionInfo.fill_unfilled pytest 0.1.dev424+gcab02e6 reference/reference.html#pytest.ExceptionInfo.fill_unfilled - :py:method:`pytest.ExceptionInfo.fill_unfilled`
pytest.ExceptionInfo.for_later pytest 0.1.dev424+gcab02e6 reference/reference.html#pytest.ExceptionInfo.for_later - :py:method:`pytest.ExceptionInfo.for_later`
pytest.ExceptionInfo.from_current pytest 0.1.dev424+gcab02e6 reference/reference.html#pytest.ExceptionInfo.from_current - :py:method:`pytest.ExceptionInfo.from_current`
pytest.ExceptionInfo.from_exc_info pytest 0.1.dev424+gcab02e6 reference/reference.html#pytest.ExceptionInfo.from_exc_info - :py:method:`pytest.ExceptionInfo.from_exc_info`
pytest.ExceptionInfo.getrepr pytest 0.1.dev424+gcab02e6 reference/reference.html#pytest.ExceptionInfo.getrepr - :py:method:`pytest.ExceptionInfo.getrepr`
pytest.ExceptionInfo.match pytest 0.1.dev424+gcab02e6 reference/reference.html#pytest.ExceptionInfo.match - :py:method:`pytest.ExceptionInfo.match`
pytest.FixtureRequest.addfinalizer pytest 0.1.dev424+gcab02e6 reference/reference.html#pytest.FixtureRequest.addfinalizer - :py:method:`pytest.FixtureRequest.addfinalizer`
pytest.FixtureRequest.applymarker pytest 0.1.dev424+gcab02e6 reference/reference.html#pytest.FixtureRequest.applymarker - :py:method:`pytest.FixtureRequest.applymarker`
pytest.FixtureRequest.getfixturevalue pytest 0.1.dev424+gcab02e6 reference/reference.html#pytest.FixtureRequest.getfixturevalue - :py:method:`pytest.FixtureRequest.getfixturevalue`
pytest.FixtureRequest.raiseerror pytest 0.1.dev424+gcab02e6 reference/reference.html#pytest.FixtureRequest.raiseerror - :py:method:`pytest.FixtureRequest.raiseerror`
pytest.Function.from_parent pytest 0.1.dev424+gcab02e6 reference/reference.html#pytest.Function.from_parent - :py:method:`pytest.Function.from_parent`
pytest.Function.repr_failure pytest 0.1.dev424+gcab02e6 reference/reference.html#pytest.Function.repr_failure - :py:method:`pytest.Function.repr_failure`
pytest.Function.runtest pytest 0.1.dev424+gcab02e6 reference/reference.html#pytest.Function.runtest - :py:method:`pytest.Function.runtest`
pytest.HookRecorder.getcalls pytest 0.1.dev424+gcab02e6 reference/reference.html#pytest.HookRecorder.getcalls - :py:method:`pytest.HookRecorder.getcalls`
pytest.HookRecorder.matchreport pytest 0.1.dev424+gcab02e6 reference/reference.html#pytest.HookRecorder.matchreport - :py:method:`pytest.HookRecorder.matchreport`
pytest.Item.add_report_section pytest 0.1.dev424+gcab02e6 reference/reference.html#pytest.Item.add_report_section - :py:method:`pytest.Item.add_report_section`
pytest.Item.reportinfo pytest 0.1.dev424+gcab02e6 reference/reference.html#pytest.Item.reportinfo - :py:method:`pytest.Item.reportinfo`
pytest.Item.runtest pytest 0.1.dev424+gcab02e6 reference/reference.html#pytest.Item.runtest - :py:method:`pytest.Item.runtest`
pytest.LineMatcher.__str__ pytest 0.1.dev424+gcab02e6 reference/reference.html#pytest.LineMatcher.__str__ - :py:method:`pytest.LineMatcher.__str__`
pytest.LineMatcher.fnmatch_lines pytest 0.1.dev424+gcab02e6 reference/reference.html#pytest.LineMatcher.fnmatch_lines - :py:method:`pytest.LineMatcher.fnmatch_lines`
pytest.LineMatcher.fnmatch_lines_random pytest 0.1.dev424+gcab02e6 reference/reference.html#pytest.LineMatcher.fnmatch_lines_random - :py:method:`pytest.LineMatcher.fnmatch_lines_random`
pytest.LineMatcher.get_lines_after pytest 0.1.dev424+gcab02e6 reference/reference.html#pytest.LineMatcher.get_lines_after - :py:method:`pytest.LineMatcher.get_lines_after`
pytest.LineMatcher.no_fnmatch_line pytest 0.1.dev424+gcab02e6 reference/reference.html#pytest.LineMatcher.no_fnmatch_line - :py:method:`pytest.LineMatcher.no_fnmatch_line`
pytest.LineMatcher.no_re_match_line pytest 0.1.dev424+gcab02e6 reference/reference.html#pytest.LineMatcher.no_re_match_line - :py:method:`pytest.LineMatcher.no_re_match_line`
pytest.LineMatcher.re_match_lines pytest 0.1.dev424+gcab02e6 reference/reference.html#pytest.LineMatcher.re_match_lines - :py:method:`pytest.LineMatcher.re_match_lines`
pytest.LineMatcher.re_match_lines_random pytest 0.1.dev424+gcab02e6 reference/reference.html#pytest.LineMatcher.re_match_lines_random - :py:method:`pytest.LineMatcher.re_match_lines_random`
pytest.LineMatcher.str pytest 0.1.dev424+gcab02e6 reference/reference.html#pytest.LineMatcher.str - :py:method:`pytest.LineMatcher.str`
pytest.LogCaptureFixture.at_level pytest 0.1.dev424+gcab02e6 reference/reference.html#pytest.LogCaptureFixture.at_level - :py:method:`pytest.LogCaptureFixture.at_level`
pytest.LogCaptureFixture.clear pytest 0.1.dev424+gcab02e6 reference/reference.html#pytest.LogCaptureFixture.clear - :py:method:`pytest.LogCaptureFixture.clear`
pytest.LogCaptureFixture.get_records pytest 0.1.dev424+gcab02e6 reference/reference.html#pytest.LogCaptureFixture.get_records - :py:method:`pytest.LogCaptureFixture.get_records`
pytest.LogCaptureFixture.set_level pytest 0.1.dev424+gcab02e6 reference/reference.html#pytest.LogCaptureFixture.set_level - :py:method:`pytest.LogCaptureFixture.set_level`
pytest.Mark.combined_with pytest 0.1.dev424+gcab02e6 reference/reference.html#pytest.Mark.combined_with - :py:method:`pytest.Mark.combined_with`
pytest.MarkDecorator.with_args pytest 0.1.dev424+gcab02e6 reference/reference.html#pytest.MarkDecorator.with_args - :py:method:`pytest.MarkDecorator.with_args`
pytest.Metafunc.parametrize pytest 0.1.dev424+gcab02e6 reference/reference.html#pytest.Metafunc.parametrize - :py:method:`pytest.Metafunc.parametrize`
pytest.Module.collect pytest 0.1.dev424+gcab02e6 reference/reference.html#pytest.Module.collect - :py:method:`pytest.Module.collect`
pytest.MonkeyPatch.chdir pytest 0.1.dev424+gcab02e6 reference/reference.html#pytest.MonkeyPatch.chdir - :py:method:`pytest.MonkeyPatch.chdir`
pytest.MonkeyPatch.context pytest 0.1.dev424+gcab02e6 reference/reference.html#pytest.MonkeyPatch.context - :py:method:`pytest.MonkeyPatch.context`
pytest.MonkeyPatch.delattr pytest 0.1.dev424+gcab02e6 reference/reference.html#pytest.MonkeyPatch.delattr - :py:method:`pytest.MonkeyPatch.delattr`
pytest.MonkeyPatch.delenv pytest 0.1.dev424+gcab02e6 reference/reference.html#pytest.MonkeyPatch.delenv - :py:method:`pytest.MonkeyPatch.delenv`
pytest.MonkeyPatch.delitem pytest 0.1.dev424+gcab02e6 reference/reference.html#pytest.MonkeyPatch.delitem - :py:method:`pytest.MonkeyPatch.delitem`
pytest.MonkeyPatch.setattr pytest 0.1.dev424+gcab02e6 reference/reference.html#pytest.MonkeyPatch.setattr - :py:method:`pytest.MonkeyPatch.setattr`
pytest.MonkeyPatch.setenv pytest 0.1.dev424+gcab02e6 reference/reference.html#pytest.MonkeyPatch.setenv - :py:method:`pytest.MonkeyPatch.setenv`
pytest.MonkeyPatch.setitem pytest 0.1.dev424+gcab02e6 reference/reference.html#pytest.MonkeyPatch.setitem - :py:method:`pytest.MonkeyPatch.setitem`
pytest.MonkeyPatch.syspath_prepend pytest 0.1.dev424+gcab02e6 reference/reference.html#pytest.MonkeyPatch.syspath_prepend - :py:method:`pytest.MonkeyPatch.syspath_prepend`
pytest.MonkeyPatch.undo pytest 0.1.dev424+gcab02e6 reference/reference.html#pytest.MonkeyPatch.undo - :py:method:`pytest.MonkeyPatch.undo`
pytest.OptionGroup.addoption pytest 0.1.dev424+gcab02e6 reference/reference.html#pytest.OptionGroup.addoption - :py:method:`pytest.OptionGroup.addoption`
pytest.Parser.addini pytest 0.1.dev424+gcab02e6 reference/reference.html#pytest.Parser.addini - :py:method:`pytest.Parser.addini`
pytest.Parser.addoption pytest 0.1.dev424+gcab02e6 reference/reference.html#pytest.Parser.addoption - :py:method:`pytest.Parser.addoption`
pytest.Parser.getgroup pytest 0.1.dev424+gcab02e6 reference/reference.html#pytest.Parser.getgroup - :py:method:`pytest.Parser.getgroup`
pytest.Parser.parse_known_and_unknown_args pytest 0.1.dev424+gcab02e6 reference/reference.html#pytest.Parser.parse_known_and_unknown_args - :py:method:`pytest.Parser.parse_known_and_unknown_args`
pytest.Parser.parse_known_args pytest 0.1.dev424+gcab02e6 reference/reference.html#pytest.Parser.parse_known_args - :py:method:`pytest.Parser.parse_known_args`
pytest.PytestPluginManager.add_hookcall_monitoring pytest 0.1.dev424+gcab02e6 reference/reference.html#pytest.PytestPluginManager.add_hookcall_monitoring - :py:method:`pytest.PytestPluginManager.add_hookcall_monitoring`
pytest.PytestPluginManager.add_hookspecs pytest 0.1.dev424+gcab02e6 reference/reference.html#pytest.PytestPluginManager.add_hookspecs - :py:method:`pytest.PytestPluginManager.add_hookspecs`
pytest.PytestPluginManager.check_pending pytest 0.1.dev424+gcab02e6 reference/reference.html#pytest.PytestPluginManager.check_pending - :py:method:`pytest.PytestPluginManager.check_pending`
pytest.PytestPluginManager.enable_tracing pytest 0.1.dev424+gcab02e6 reference/reference.html#pytest.PytestPluginManager.enable_tracing - :py:method:`pytest.PytestPluginManager.enable_tracing`
pytest.PytestPluginManager.get_canonical_name pytest 0.1.dev424+gcab02e6 reference/reference.html#pytest.PytestPluginManager.get_canonical_name - :py:method:`pytest.PytestPluginManager.get_canonical_name`
pytest.PytestPluginManager.get_hookcallers pytest 0.1.dev424+gcab02e6 reference/reference.html#pytest.PytestPluginManager.get_hookcallers - :py:method:`pytest.PytestPluginManager.get_hookcallers`
pytest.PytestPluginManager.get_name pytest 0.1.dev424+gcab02e6 reference/reference.html#pytest.PytestPluginManager.get_name - :py:method:`pytest.PytestPluginManager.get_name`
pytest.PytestPluginManager.get_plugin pytest 0.1.dev424+gcab02e6 reference/reference.html#pytest.PytestPluginManager.get_plugin - :py:method:`pytest.PytestPluginManager.get_plugin`
pytest.PytestPluginManager.get_plugins pytest 0.1.dev424+gcab02e6 reference/reference.html#pytest.PytestPluginManager.get_plugins - :py:method:`pytest.PytestPluginManager.get_plugins`
pytest.PytestPluginManager.getplugin pytest 0.1.dev424+gcab02e6 reference/reference.html#pytest.PytestPluginManager.getplugin - :py:method:`pytest.PytestPluginManager.getplugin`
pytest.PytestPluginManager.has_plugin pytest 0.1.dev424+gcab02e6 reference/reference.html#pytest.PytestPluginManager.has_plugin - :py:method:`pytest.PytestPluginManager.has_plugin`
pytest.PytestPluginManager.hasplugin pytest 0.1.dev424+gcab02e6 reference/reference.html#pytest.PytestPluginManager.hasplugin - :py:method:`pytest.PytestPluginManager.hasplugin`
pytest.PytestPluginManager.import_plugin pytest 0.1.dev424+gcab02e6 reference/reference.html#pytest.PytestPluginManager.import_plugin - :py:method:`pytest.PytestPluginManager.import_plugin`
pytest.PytestPluginManager.is_blocked pytest 0.1.dev424+gcab02e6 reference/reference.html#pytest.PytestPluginManager.is_blocked - :py:method:`pytest.PytestPluginManager.is_blocked`
pytest.PytestPluginManager.is_registered pytest 0.1.dev424+gcab02e6 reference/reference.html#pytest.PytestPluginManager.is_registered - :py:method:`pytest.PytestPluginManager.is_registered`
pytest.PytestPluginManager.list_name_plugin pytest 0.1.dev424+gcab02e6 reference/reference.html#pytest.PytestPluginManager.list_name_plugin - :py:method:`pytest.PytestPluginManager.list_name_plugin`
pytest.PytestPluginManager.list_plugin_distinfo pytest 0.1.dev424+gcab02e6 reference/reference.html#pytest.PytestPluginManager.list_plugin_distinfo - :py:method:`pytest.PytestPluginManager.list_plugin_distinfo`
pytest.PytestPluginManager.load_setuptools_entrypoints pytest 0.1.dev424+gcab02e6 reference/reference.html#pytest.PytestPluginManager.load_setuptools_entrypoints - :py:method:`pytest.PytestPluginManager.load_setuptools_entrypoints`
pytest.PytestPluginManager.parse_hookimpl_opts pytest 0.1.dev424+gcab02e6 reference/reference.html#pytest.PytestPluginManager.parse_hookimpl_opts - :py:method:`pytest.PytestPluginManager.parse_hookimpl_opts`
pytest.PytestPluginManager.parse_hookspec_opts pytest 0.1.dev424+gcab02e6 reference/reference.html#pytest.PytestPluginManager.parse_hookspec_opts - :py:method:`pytest.PytestPluginManager.parse_hookspec_opts`
pytest.PytestPluginManager.register pytest 0.1.dev424+gcab02e6 reference/reference.html#pytest.PytestPluginManager.register - :py:method:`pytest.PytestPluginManager.register`
pytest.PytestPluginManager.set_blocked pytest 0.1.dev424+gcab02e6 reference/reference.html#pytest.PytestPluginManager.set_blocked - :py:method:`pytest.PytestPluginManager.set_blocked`
pytest.PytestPluginManager.subset_hook_caller pytest 0.1.dev424+gcab02e6 reference/reference.html#pytest.PytestPluginManager.subset_hook_caller - :py:method:`pytest.PytestPluginManager.subset_hook_caller`
pytest.PytestPluginManager.unregister pytest 0.1.dev424+gcab02e6 reference/reference.html#pytest.PytestPluginManager.unregister - :py:method:`pytest.PytestPluginManager.unregister`
pytest.Pytester.chdir pytest 0.1.dev424+gcab02e6 reference/reference.html#pytest.Pytester.chdir - :py:method:`pytest.Pytester.chdir`
pytest.Pytester.collect_by_name pytest 0.1.dev424+gcab02e6 reference/reference.html#pytest.Pytester.collect_by_name - :py:method:`pytest.Pytester.collect_by_name`
pytest.Pytester.copy_example pytest 0.1.dev424+gcab02e6 reference/reference.html#pytest.Pytester.copy_example - :py:method:`pytest.Pytester.copy_example`
pytest.Pytester.genitems pytest 0.1.dev424+gcab02e6 reference/reference.html#pytest.Pytester.genitems - :py:method:`pytest.Pytester.genitems`
pytest.Pytester.getinicfg pytest 0.1.dev424+gcab02e6 reference/reference.html#pytest.Pytester.getinicfg - :py:method:`pytest.Pytester.getinicfg`
pytest.Pytester.getitem pytest 0.1.dev424+gcab02e6 reference/reference.html#pytest.Pytester.getitem - :py:method:`pytest.Pytester.getitem`
pytest.Pytester.getitems pytest 0.1.dev424+gcab02e6 reference/reference.html#pytest.Pytester.getitems - :py:method:`pytest.Pytester.getitems`
pytest.Pytester.getmodulecol pytest 0.1.dev424+gcab02e6 reference/reference.html#pytest.Pytester.getmodulecol - :py:method:`pytest.Pytester.getmodulecol`
pytest.Pytester.getnode pytest 0.1.dev424+gcab02e6 reference/reference.html#pytest.Pytester.getnode - :py:method:`pytest.Pytester.getnode`
pytest.Pytester.getpathnode pytest 0.1.dev424+gcab02e6 reference/reference.html#pytest.Pytester.getpathnode - :py:method:`pytest.Pytester.getpathnode`
pytest.Pytester.inline_genitems pytest 0.1.dev424+gcab02e6 reference/reference.html#pytest.Pytester.inline_genitems - :py:method:`pytest.Pytester.inline_genitems`
pytest.Pytester.inline_run pytest 0.1.dev424+gcab02e6 reference/reference.html#pytest.Pytester.inline_run - :py:method:`pytest.Pytester.inline_run`
pytest.Pytester.inline_runsource pytest 0.1.dev424+gcab02e6 reference/reference.html#pytest.Pytester.inline_runsource - :py:method:`pytest.Pytester.inline_runsource`
pytest.Pytester.make_hook_recorder pytest 0.1.dev424+gcab02e6 reference/reference.html#pytest.Pytester.make_hook_recorder - :py:method:`pytest.Pytester.make_hook_recorder`
pytest.Pytester.makeconftest pytest 0.1.dev424+gcab02e6 reference/reference.html#pytest.Pytester.makeconftest - :py:method:`pytest.Pytester.makeconftest`
pytest.Pytester.makefile pytest 0.1.dev424+gcab02e6 reference/reference.html#pytest.Pytester.makefile - :py:method:`pytest.Pytester.makefile`
pytest.Pytester.makeini pytest 0.1.dev424+gcab02e6 reference/reference.html#pytest.Pytester.makeini - :py:method:`pytest.Pytester.makeini`
pytest.Pytester.makepyfile pytest 0.1.dev424+gcab02e6 reference/reference.html#pytest.Pytester.makepyfile - :py:method:`pytest.Pytester.makepyfile`
pytest.Pytester.makepyprojecttoml pytest 0.1.dev424+gcab02e6 reference/reference.html#pytest.Pytester.makepyprojecttoml - :py:method:`pytest.Pytester.makepyprojecttoml`
pytest.Pytester.maketxtfile pytest 0.1.dev424+gcab02e6 reference/reference.html#pytest.Pytester.maketxtfile - :py:method:`pytest.Pytester.maketxtfile`
pytest.Pytester.mkdir pytest 0.1.dev424+gcab02e6 reference/reference.html#pytest.Pytester.mkdir - :py:method:`pytest.Pytester.mkdir`
pytest.Pytester.mkpydir pytest 0.1.dev424+gcab02e6 reference/reference.html#pytest.Pytester.mkpydir - :py:method:`pytest.Pytester.mkpydir`
pytest.Pytester.parseconfig pytest 0.1.dev424+gcab02e6 reference/reference.html#pytest.Pytester.parseconfig - :py:method:`pytest.Pytester.parseconfig`
pytest.Pytester.parseconfigure pytest 0.1.dev424+gcab02e6 reference/reference.html#pytest.Pytester.parseconfigure - :py:method:`pytest.Pytester.parseconfigure`
pytest.Pytester.popen pytest 0.1.dev424+gcab02e6 reference/reference.html#pytest.Pytester.popen - :py:method:`pytest.Pytester.popen`
pytest.Pytester.run pytest 0.1.dev424+gcab02e6 reference/reference.html#pytest.Pytester.run - :py:method:`pytest.Pytester.run`
pytest.Pytester.runitem pytest 0.1.dev424+gcab02e6 reference/reference.html#pytest.Pytester.runitem - :py:method:`pytest.Pytester.runitem`
pytest.Pytester.runpytest pytest 0.1.dev424+gcab02e6 reference/reference.html#pytest.Pytester.runpytest - :py:method:`pytest.Pytester.runpytest`
pytest.Pytester.runpytest_inprocess pytest 0.1.dev424+gcab02e6 reference/reference.html#pytest.Pytester.runpytest_inprocess - :py:method:`pytest.Pytester.runpytest_inprocess`
pytest.Pytester.runpytest_subprocess pytest 0.1.dev424+gcab02e6 reference/reference.html#pytest.Pytester.runpytest_subprocess - :py:method:`pytest.Pytester.runpytest_subprocess`
pytest.Pytester.runpython pytest 0.1.dev424+gcab02e6 reference/reference.html#pytest.Pytester.runpython - :py:method:`pytest.Pytester.runpython`
pytest.Pytester.runpython_c pytest 0.1.dev424+gcab02e6 reference/reference.html#pytest.Pytester.runpython_c - :py:method:`pytest.Pytester.runpython_c`
pytest.Pytester.spawn pytest 0.1.dev424+gcab02e6 reference/reference.html#pytest.Pytester.spawn - :py:method:`pytest.Pytester.spawn`
pytest.Pytester.spawn_pytest pytest 0.1.dev424+gcab02e6 reference/reference.html#pytest.Pytester.spawn_pytest - :py:method:`pytest.Pytester.spawn_pytest`
pytest.Pytester.syspathinsert pytest 0.1.dev424+gcab02e6 reference/reference.html#pytest.Pytester.syspathinsert - :py:method:`pytest.Pytester.syspathinsert`
pytest.RunResult.assert_outcomes pytest 0.1.dev424+gcab02e6 reference/reference.html#pytest.RunResult.assert_outcomes - :py:method:`pytest.RunResult.assert_outcomes`
pytest.RunResult.parse_summary_nouns pytest 0.1.dev424+gcab02e6 reference/reference.html#pytest.RunResult.parse_summary_nouns - :py:method:`pytest.RunResult.parse_summary_nouns`
pytest.RunResult.parseoutcomes pytest 0.1.dev424+gcab02e6 reference/reference.html#pytest.RunResult.parseoutcomes - :py:method:`pytest.RunResult.parseoutcomes`
pytest.Session.collect pytest 0.1.dev424+gcab02e6 reference/reference.html#pytest.Session.collect - :py:method:`pytest.Session.collect`
pytest.Session.perform_collect pytest 0.1.dev424+gcab02e6 reference/reference.html#pytest.Session.perform_collect - :py:method:`pytest.Session.perform_collect`
pytest.Stash.__contains__ pytest 0.1.dev424+gcab02e6 reference/reference.html#pytest.Stash.__contains__ - :py:method:`pytest.Stash.__contains__`
pytest.Stash.__delitem__ pytest 0.1.dev424+gcab02e6 reference/reference.html#pytest.Stash.__delitem__ - :py:method:`pytest.Stash.__delitem__`
pytest.Stash.__getitem__ pytest 0.1.dev424+gcab02e6 reference/reference.html#pytest.Stash.__getitem__ - :py:method:`pytest.Stash.__getitem__`
pytest.Stash.__len__ pytest 0.1.dev424+gcab02e6 reference/reference.html#pytest.Stash.__len__ - :py:method:`pytest.Stash.__len__`
pytest.Stash.__setitem__ pytest 0.1.dev424+gcab02e6 reference/reference.html#pytest.Stash.__setitem__ - :py:method:`pytest.Stash.__setitem__`
pytest.Stash.get pytest 0.1.dev424+gcab02e6 reference/reference.html#pytest.Stash.get - :py:method:`pytest.Stash.get`
pytest.Stash.setdefault pytest 0.1.dev424+gcab02e6 reference/reference.html#pytest.Stash.setdefault - :py:method:`pytest.Stash.setdefault`
pytest.TempPathFactory.getbasetemp pytest 0.1.dev424+gcab02e6 reference/reference.html#pytest.TempPathFactory.getbasetemp - :py:method:`pytest.TempPathFactory.getbasetemp`
pytest.TempPathFactory.mktemp pytest 0.1.dev424+gcab02e6 reference/reference.html#pytest.TempPathFactory.mktemp - :py:method:`pytest.TempPathFactory.mktemp`
pytest.TempdirFactory.getbasetemp pytest 0.1.dev424+gcab02e6 reference/reference.html#pytest.TempdirFactory.getbasetemp - :py:method:`pytest.TempdirFactory.getbasetemp`
pytest.TempdirFactory.mktemp pytest 0.1.dev424+gcab02e6 reference/reference.html#pytest.TempdirFactory.mktemp - :py:method:`pytest.TempdirFactory.mktemp`
pytest.TestReport.from_item_and_call pytest 0.1.dev424+gcab02e6 reference/reference.html#pytest.TestReport.from_item_and_call - :py:method:`pytest.TestReport.from_item_and_call`
pytest.WarningsRecorder.clear pytest 0.1.dev424+gcab02e6 reference/reference.html#pytest.WarningsRecorder.clear - :py:method:`pytest.WarningsRecorder.clear`
pytest.WarningsRecorder.pop pytest 0.1.dev424+gcab02e6 reference/reference.html#pytest.WarningsRecorder.pop - :py:method:`pytest.WarningsRecorder.pop`

py:module

Identifier Project Name Version Location Display Name Usage example
pytest pytest 0.1.dev424+gcab02e6 index.html#module-pytest - :py:mod:`pytest`

std:label

Identifier Project Name Version Location Display Name Usage example
@pytest.fixture pytest 0.1.dev424+gcab02e6 reference/fixtures.html#pytest-fixture Fixtures reference :std:ref:`@pytest.fixture`
@pytest.mark.parametrize pytest 0.1.dev424+gcab02e6 how-to/parametrize.html#pytest-mark-parametrize @pytest.mark.parametrize: parametrizing test functions :std:ref:`@pytest.mark.parametrize`
__tracebackhide__ pytest 0.1.dev424+gcab02e6 example/simple.html#tracebackhide Writing well integrated assertion helpers :std:ref:`__tracebackhide__`
about-fixtures pytest 0.1.dev424+gcab02e6 explanation/fixtures.html#about-fixtures About fixtures :std:ref:`about-fixtures`
adding a custom marker from a plugin pytest 0.1.dev424+gcab02e6 example/markers.html#adding-a-custom-marker-from-a-plugin Custom marker and command line option to control test runs :std:ref:`adding a custom marker from a plugin`
adding default options pytest 0.1.dev424+gcab02e6 reference/customize.html#adding-default-options Builtin configuration file options :std:ref:`adding default options`
addoptionhooks pytest 0.1.dev424+gcab02e6 how-to/writing_hook_functions.html#addoptionhooks Using hooks in pytest_addoption :std:ref:`addoptionhooks`
api-reference pytest 0.1.dev424+gcab02e6 reference/reference.html#api-reference API Reference :std:ref:`api-reference`
assert pytest 0.1.dev424+gcab02e6 how-to/assert.html#assert How to write and report assertions in tests :std:ref:`assert`
assert introspection pytest 0.1.dev424+gcab02e6 how-to/assert.html#assert-introspection Assertion introspection details :std:ref:`assert introspection`
assert with the assert statement pytest 0.1.dev424+gcab02e6 how-to/assert.html#assert-with-the-assert-statement Asserting with the assert statement :std:ref:`assert with the assert statement`
assert-details pytest 0.1.dev424+gcab02e6 how-to/assert.html#assert-details Assertion introspection details :std:ref:`assert-details`
asserting warnings pytest 0.1.dev424+gcab02e6 how-to/capture-warnings.html#asserting-warnings Asserting warnings with the warns function :std:ref:`asserting warnings`
asserting warnings with the warns function pytest 0.1.dev424+gcab02e6 how-to/capture-warnings.html#asserting-warnings-with-the-warns-function Asserting warnings with the warns function :std:ref:`asserting warnings with the warns function`
assertion-rewriting pytest 0.1.dev424+gcab02e6 how-to/writing_plugins.html#assertion-rewriting Assertion Rewriting :std:ref:`assertion-rewriting`
assertraises pytest 0.1.dev424+gcab02e6 how-to/assert.html#assertraises Assertions about expected exceptions :std:ref:`assertraises`
assertwarnings pytest 0.1.dev424+gcab02e6 how-to/capture-warnings.html#assertwarnings Asserting warnings with the warns function :std:ref:`assertwarnings`
assertwarns pytest 0.1.dev424+gcab02e6 how-to/assert.html#assertwarns Assertions about expected warnings :std:ref:`assertwarns`
automatic per-resource grouping pytest 0.1.dev424+gcab02e6 how-to/fixtures.html#automatic-per-resource-grouping Automatic grouping of tests by fixture instances :std:ref:`automatic per-resource grouping`
autouse pytest 0.1.dev424+gcab02e6 how-to/fixtures.html#autouse Autouse fixtures (fixtures you don’t have to request) :std:ref:`autouse`
autouse fixtures pytest 0.1.dev424+gcab02e6 how-to/fixtures.html#autouse-fixtures Autouse fixtures (fixtures you don’t have to request) :std:ref:`autouse fixtures`
autouse order pytest 0.1.dev424+gcab02e6 reference/fixtures.html#autouse-order Autouse fixtures are executed first within their scope :std:ref:`autouse order`
available installable plugins pytest 0.1.dev424+gcab02e6 how-to/plugins.html#available-installable-plugins Requiring/Loading plugins in a test module or conftest file :std:ref:`available installable plugins`
backwards-compatibility pytest 0.1.dev424+gcab02e6 backwards-compatibility.html#backwards-compatibility Backwards Compatibility Policy :std:ref:`backwards-compatibility`
base temporary directory pytest 0.1.dev424+gcab02e6 how-to/tmp_path.html#base-temporary-directory The default base temporary directory :std:ref:`base temporary directory`
bash_completion pytest 0.1.dev424+gcab02e6 how-to/bash-completion.html#bash-completion How to set up bash completion :std:ref:`bash_completion`
breakpoint-builtin pytest 0.1.dev424+gcab02e6 how-to/failures.html#breakpoint-builtin Using the builtin breakpoint function :std:ref:`breakpoint-builtin`
breakpoints pytest 0.1.dev424+gcab02e6 how-to/failures.html#breakpoints Setting breakpoints :std:ref:`breakpoints`
builtin plugins pytest 0.1.dev424+gcab02e6 how-to/plugins.html#builtin-plugins - :std:ref:`builtin plugins`
cache pytest 0.1.dev424+gcab02e6 how-to/cache.html#cache How to re-run failed tests and maintain state between test runs :std:ref:`cache`
cache stepwise pytest 0.1.dev424+gcab02e6 how-to/cache.html#cache-stepwise Stepwise :std:ref:`cache stepwise`
cache_provider pytest 0.1.dev424+gcab02e6 how-to/cache.html#cache-provider How to re-run failed tests and maintain state between test runs :std:ref:`cache_provider`
cached_setup deprecated pytest 0.1.dev424+gcab02e6 deprecations.html#cached-setup-deprecated cached_setup :std:ref:`cached_setup deprecated`
calling fixtures directly deprecated pytest 0.1.dev424+gcab02e6 deprecations.html#calling-fixtures-directly-deprecated Calling fixtures directly :std:ref:`calling fixtures directly deprecated`
capture-method pytest 0.1.dev424+gcab02e6 how-to/capture-stdout-stderr.html#capture-method Setting capturing methods or disabling capturing :std:ref:`capture-method`
captures pytest 0.1.dev424+gcab02e6 how-to/capture-stdout-stderr.html#captures How to capture stdout/stderr output :std:ref:`captures`
change naming conventions pytest 0.1.dev424+gcab02e6 example/pythoncollection.html#change-naming-conventions Changing naming conventions :std:ref:`change naming conventions`
changelog pytest 0.1.dev424+gcab02e6 changelog.html#changelog Changelog :std:ref:`changelog`
classic xunit pytest 0.1.dev424+gcab02e6 how-to/xunit_setup.html#classic-xunit How to implement xunit-style set-up :std:ref:`classic xunit`
cmdline-preparse-deprecated pytest 0.1.dev424+gcab02e6 deprecations.html#cmdline-preparse-deprecated Passing msg= to pytest.skip, pytest.fail or pytest.exit :std:ref:`cmdline-preparse-deprecated`
cmdunregister pytest 0.1.dev424+gcab02e6 how-to/plugins.html#cmdunregister Deactivating / unregistering a plugin by name :std:ref:`cmdunregister`
command-line-flags pytest 0.1.dev424+gcab02e6 reference/reference.html#command-line-flags Command-line Flags :std:ref:`command-line-flags`
compatibility notes pytest 0.1.dev424+gcab02e6 funcarg_compare.html#compatibility-notes Conclusion and compatibility notes :std:ref:`compatibility notes`
condition booleans pytest 0.1.dev424+gcab02e6 how-to/skipping.html#condition-booleans Skipping test functions :std:ref:`condition booleans`
config file formats pytest 0.1.dev424+gcab02e6 reference/customize.html#config-file-formats Configuration file formats :std:ref:`config file formats`
config.cache pytest 0.1.dev424+gcab02e6 how-to/cache.html#config-cache - :std:ref:`config.cache`
config.warn and node.warn deprecated pytest 0.1.dev424+gcab02e6 deprecations.html#config-warn-and-node-warn-deprecated Config.warn and Node.warn :std:ref:`config.warn and node.warn deprecated`
configfiles pytest 0.1.dev424+gcab02e6 reference/customize.html#configfiles Initialization: determining rootdir and configfile :std:ref:`configfiles`
conftest pytest 0.1.dev424+gcab02e6 reference/fixtures.html#conftest Fixture availability :std:ref:`conftest`
conftest.py pytest 0.1.dev424+gcab02e6 reference/fixtures.html#conftest-py Fixture availability :std:ref:`conftest.py`
conftest.py plugins pytest 0.1.dev424+gcab02e6 how-to/writing_plugins.html#conftest-py-plugins conftest.py: local per-directory plugins :std:ref:`conftest.py plugins`
contact pytest 0.1.dev424+gcab02e6 contact.html#contact Contact channels :std:ref:`contact`
contact channels pytest 0.1.dev424+gcab02e6 contact.html#contact-channels Contact channels :std:ref:`contact channels`
contributing pytest 0.1.dev424+gcab02e6 contributing.html#contributing Contribution getting started :std:ref:`contributing`
controlling-warnings pytest 0.1.dev424+gcab02e6 how-to/capture-warnings.html#controlling-warnings Controlling warnings :std:ref:`controlling-warnings`
custom_failure_messages pytest 0.1.dev424+gcab02e6 how-to/capture-warnings.html#custom-failure-messages Custom failure messages :std:ref:`custom_failure_messages`
customizing-test-collection pytest 0.1.dev424+gcab02e6 example/pythoncollection.html#customizing-test-collection Customizing test collection :std:ref:`customizing-test-collection`
deprecation-warnings pytest 0.1.dev424+gcab02e6 how-to/capture-warnings.html#deprecation-warnings DeprecationWarning and PendingDeprecationWarning :std:ref:`deprecation-warnings`
deprecations pytest 0.1.dev424+gcab02e6 deprecations.html#deprecations Deprecations and Removals :std:ref:`deprecations`
diamond-inheritance-deprecated pytest 0.1.dev424+gcab02e6 deprecations.html#diamond-inheritance-deprecated Diamond inheritance between pytest.Collector and pytest.Item :std:ref:`diamond-inheritance-deprecated`
disable capturing pytest 0.1.dev424+gcab02e6 how-to/capture-stdout-stderr.html#disable-capturing - :std:ref:`disable capturing`
doctest pytest 0.1.dev424+gcab02e6 how-to/doctest.html#doctest How to run doctests :std:ref:`doctest`
doctest_namespace pytest 0.1.dev424+gcab02e6 how-to/doctest.html#doctest-namespace ‘doctest_namespace’ fixture :std:ref:`doctest_namespace`
durations pytest 0.1.dev424+gcab02e6 how-to/usage.html#durations Profiling test execution duration :std:ref:`durations`
dynamic scope pytest 0.1.dev424+gcab02e6 how-to/fixtures.html#dynamic-scope Dynamic scope :std:ref:`dynamic scope`
ensuring a function triggers a deprecation warning pytest 0.1.dev424+gcab02e6 how-to/capture-warnings.html#ensuring-a-function-triggers-a-deprecation-warning Ensuring code triggers a deprecation warning :std:ref:`ensuring a function triggers a deprecation warning`
ensuring_function_triggers pytest 0.1.dev424+gcab02e6 how-to/capture-warnings.html#ensuring-function-triggers Ensuring code triggers a deprecation warning :std:ref:`ensuring_function_triggers`
examples pytest 0.1.dev424+gcab02e6 example/index.html#examples Examples and customization tricks :std:ref:`examples`
excontrolskip pytest 0.1.dev424+gcab02e6 example/simple.html#excontrolskip Control skipping of tests according to command line option :std:ref:`excontrolskip`
existingtestsuite pytest 0.1.dev424+gcab02e6 how-to/existingtestsuite.html#existingtestsuite How to use pytest with an existing test suite :std:ref:`existingtestsuite`
exit-codes pytest 0.1.dev424+gcab02e6 reference/exit-codes.html#exit-codes Exit codes :std:ref:`exit-codes`
explanation pytest 0.1.dev424+gcab02e6 explanation/index.html#explanation Explanation :std:ref:`explanation`
external plugins pytest 0.1.dev424+gcab02e6 how-to/plugins.html#external-plugins How to install and use plugins :std:ref:`external plugins`
extplugins pytest 0.1.dev424+gcab02e6 how-to/plugins.html#extplugins How to install and use plugins :std:ref:`extplugins`
faulthandler pytest 0.1.dev424+gcab02e6 how-to/failures.html#faulthandler Fault Handler :std:ref:`faulthandler`
features pytest 0.1.dev424+gcab02e6 index.html#features pytest: helps you write better programs :std:ref:`features`
filterwarnings pytest 0.1.dev424+gcab02e6 how-to/capture-warnings.html#filterwarnings @pytest.mark.filterwarnings :std:ref:`filterwarnings`
finalization pytest 0.1.dev424+gcab02e6 how-to/fixtures.html#finalization Teardown/Cleanup (AKA Fixture finalization) :std:ref:`finalization`
findpluginname pytest 0.1.dev424+gcab02e6 how-to/plugins.html#findpluginname Finding out which plugins are active :std:ref:`findpluginname`
firstresult pytest 0.1.dev424+gcab02e6 how-to/writing_hook_functions.html#firstresult firstresult: stop at first non-None result :std:ref:`firstresult`
fixbugs pytest 0.1.dev424+gcab02e6 contributing.html#fixbugs Fix bugs :std:ref:`fixbugs`
fixture pytest 0.1.dev424+gcab02e6 reference/fixtures.html#fixture Fixtures reference :std:ref:`fixture`
fixture order pytest 0.1.dev424+gcab02e6 reference/fixtures.html#fixture-order Fixture instantiation order :std:ref:`fixture order`
fixture-factory pytest 0.1.dev424+gcab02e6 how-to/fixtures.html#fixture-factory Factories as fixtures :std:ref:`fixture-factory`
fixture-parametrize pytest 0.1.dev424+gcab02e6 how-to/fixtures.html#fixture-parametrize Parametrizing fixtures :std:ref:`fixture-parametrize`
fixture-parametrize-marks pytest 0.1.dev424+gcab02e6 how-to/fixtures.html#fixture-parametrize-marks Using marks with parametrized fixtures :std:ref:`fixture-parametrize-marks`
fixtures pytest 0.1.dev424+gcab02e6 reference/fixtures.html#fixtures Fixtures reference :std:ref:`fixtures`
fixtures-api pytest 0.1.dev424+gcab02e6 reference/reference.html#fixtures-api Fixtures :std:ref:`fixtures-api`
fixtures-signal-cleanup pytest 0.1.dev424+gcab02e6 explanation/fixtures.html#fixtures-signal-cleanup A note about fixture cleanup :std:ref:`fixtures-signal-cleanup`
freezing-pytest pytest 0.1.dev424+gcab02e6 example/simple.html#freezing-pytest Freezing pytest :std:ref:`freezing-pytest`
funcargcompare pytest 0.1.dev424+gcab02e6 funcarg_compare.html#funcargcompare pytest-2.3: reasoning for fixture/funcarg evolution :std:ref:`funcargcompare`
funcargscompat pytest 0.1.dev424+gcab02e6 funcarg_compare.html#funcargscompat Conclusion and compatibility notes :std:ref:`funcargscompat`
genindex pytest 0.1.dev424+gcab02e6 genindex.html Index :std:ref:`genindex`
get-started pytest 0.1.dev424+gcab02e6 getting-started.html#get-started Get Started :std:ref:`get-started`
getstarted pytest 0.1.dev424+gcab02e6 getting-started.html#getstarted Install pytest :std:ref:`getstarted`
goodpractices pytest 0.1.dev424+gcab02e6 explanation/goodpractices.html#goodpractices Good Integration Practices :std:ref:`goodpractices`
historical funcargs and pytest.funcargs pytest 0.1.dev424+gcab02e6 historical-notes.html#historical-funcargs-and-pytest-funcargs funcargs and pytest_funcarg__ :std:ref:`historical funcargs and pytest.funcargs`
hook-reference pytest 0.1.dev424+gcab02e6 reference/reference.html#hook-reference Hooks :std:ref:`hook-reference`
hookwrapper pytest 0.1.dev424+gcab02e6 how-to/writing_hook_functions.html#hookwrapper hookwrapper: executing around other hooks :std:ref:`hookwrapper`
how to change command line options defaults pytest 0.1.dev424+gcab02e6 reference/customize.html#how-to-change-command-line-options-defaults Builtin configuration file options :std:ref:`how to change command line options defaults`
how-to pytest 0.1.dev424+gcab02e6 how-to/index.html#how-to How-to guides :std:ref:`how-to`
how-to-fixtures pytest 0.1.dev424+gcab02e6 how-to/fixtures.html#how-to-fixtures How to use fixtures :std:ref:`how-to-fixtures`
how-to-handle-failures pytest 0.1.dev424+gcab02e6 how-to/failures.html#how-to-handle-failures How to handle test failures :std:ref:`how-to-handle-failures`
how-to-manage-output pytest 0.1.dev424+gcab02e6 how-to/output.html#how-to-manage-output Managing pytest’s output :std:ref:`how-to-manage-output`
how-to-modifying-python-tb-printing pytest 0.1.dev424+gcab02e6 how-to/output.html#how-to-modifying-python-tb-printing Modifying Python traceback printing :std:ref:`how-to-modifying-python-tb-printing`
import-modes pytest 0.1.dev424+gcab02e6 explanation/pythonpath.html#import-modes Import modes :std:ref:`import-modes`
ini options ref pytest 0.1.dev424+gcab02e6 reference/reference.html#ini-options-ref Configuration Options :std:ref:`ini options ref`
initialization-hooks pytest 0.1.dev424+gcab02e6 reference/reference.html#initialization-hooks Initialization hooks :std:ref:`initialization-hooks`
installation pytest 0.1.dev424+gcab02e6 getting-started.html#installation Install pytest :std:ref:`installation`
instance-collector-deprecation pytest 0.1.dev424+gcab02e6 deprecations.html#instance-collector-deprecation The pytest.Instance collector :std:ref:`instance-collector-deprecation`
interdependent fixtures pytest 0.1.dev424+gcab02e6 how-to/fixtures.html#interdependent-fixtures Modularity: using fixtures from a fixture function :std:ref:`interdependent fixtures`
internal classes accessed through node deprecated pytest 0.1.dev424+gcab02e6 deprecations.html#internal-classes-accessed-through-node-deprecated Internal classes accessed through Node :std:ref:`internal classes accessed through node deprecated`
internal-warnings pytest 0.1.dev424+gcab02e6 how-to/capture-warnings.html#internal-warnings Internal pytest warnings :std:ref:`internal-warnings`
invoke-other pytest 0.1.dev424+gcab02e6 how-to/usage.html#invoke-other Other ways of calling pytest :std:ref:`invoke-other`
invoke-python pytest 0.1.dev424+gcab02e6 how-to/usage.html#invoke-python Calling pytest through python -m pytest :std:ref:`invoke-python`
junit-family changed default value pytest 0.1.dev424+gcab02e6 deprecations.html#junit-family-changed-default-value junit_family default value change to “xunit2” :std:ref:`junit-family changed default value`
legacy-path-hooks-deprecated pytest 0.1.dev424+gcab02e6 deprecations.html#legacy-path-hooks-deprecated Configuring hook specs/impls using markers :std:ref:`legacy-path-hooks-deprecated`
license pytest 0.1.dev424+gcab02e6 license.html#license License :std:ref:`license`
live_logs pytest 0.1.dev424+gcab02e6 how-to/logging.html#live-logs Live Logs :std:ref:`live_logs`
local conftest plugins pytest 0.1.dev424+gcab02e6 how-to/writing_plugins.html#local-conftest-plugins conftest.py: local per-directory plugins :std:ref:`local conftest plugins`
localplugin pytest 0.1.dev424+gcab02e6 how-to/writing_plugins.html#localplugin conftest.py: local per-directory plugins :std:ref:`localplugin`
log_changes_3_4 pytest 0.1.dev424+gcab02e6 how-to/logging.html#log-changes-3-4 Incompatible changes in pytest 3.4 :std:ref:`log_changes_3_4`
log_colors pytest 0.1.dev424+gcab02e6 how-to/logging.html#log-colors Customizing Colors :std:ref:`log_colors`
log_release_notes pytest 0.1.dev424+gcab02e6 how-to/logging.html#log-release-notes Release notes :std:ref:`log_release_notes`
logging pytest 0.1.dev424+gcab02e6 how-to/logging.html#logging How to manage logging :std:ref:`logging`
mark pytest 0.1.dev424+gcab02e6 how-to/mark.html#mark How to mark test functions with attributes :std:ref:`mark`
mark examples pytest 0.1.dev424+gcab02e6 example/markers.html#mark-examples Working with custom markers :std:ref:`mark examples`
mark run pytest 0.1.dev424+gcab02e6 example/markers.html#mark-run Marking test functions and selecting them for a run :std:ref:`mark run`
marker-revamp pytest 0.1.dev424+gcab02e6 historical-notes.html#marker-revamp Marker revamp and iteration :std:ref:`marker-revamp`
marking individual tests when using parametrize pytest 0.1.dev424+gcab02e6 example/markers.html#marking-individual-tests-when-using-parametrize Marking individual tests when using parametrize :std:ref:`marking individual tests when using parametrize`
marks in pytest.parametrize deprecated pytest 0.1.dev424+gcab02e6 deprecations.html#marks-in-pytest-parametrize-deprecated marks in pytest.mark.parametrize :std:ref:`marks in pytest.parametrize deprecated`
marks ref pytest 0.1.dev424+gcab02e6 reference/reference.html#marks-ref Marks :std:ref:`marks ref`
maxfail pytest 0.1.dev424+gcab02e6 how-to/failures.html#maxfail Stopping after the first (or N) failures :std:ref:`maxfail`
metafunc.addcall deprecated pytest 0.1.dev424+gcab02e6 deprecations.html#metafunc-addcall-deprecated Metafunc.addcall :std:ref:`metafunc.addcall deprecated`
mixing-fixtures pytest 0.1.dev424+gcab02e6 how-to/unittest.html#mixing-fixtures Mixing pytest fixtures into unittest.TestCase subclasses using marks :std:ref:`mixing-fixtures`
modindex pytest 0.1.dev424+gcab02e6 py-modindex.html Module Index :std:ref:`modindex`
monkeypatching pytest 0.1.dev424+gcab02e6 how-to/monkeypatch.html#monkeypatching How to monkeypatch/mock modules and environments :std:ref:`monkeypatching`
newreport pytest 0.1.dev424+gcab02e6 how-to/assert.html#newreport Making use of context-sensitive comparisons :std:ref:`newreport`
node-ctor-fspath-deprecation pytest 0.1.dev424+gcab02e6 deprecations.html#node-ctor-fspath-deprecation fspath argument for Node constructors replaced with pathlib.Path :std:ref:`node-ctor-fspath-deprecation`
node-id pytest 0.1.dev424+gcab02e6 example/markers.html#node-id - :std:ref:`node-id`
nodeids pytest 0.1.dev424+gcab02e6 how-to/usage.html#nodeids - :std:ref:`nodeids`
non-python tests pytest 0.1.dev424+gcab02e6 example/nonpython.html#non-python-tests Working with non-python tests :std:ref:`non-python tests`
nose-deprecation pytest 0.1.dev424+gcab02e6 deprecations.html#nose-deprecation Support for tests written for nose :std:ref:`nose-deprecation`
noseintegration pytest 0.1.dev424+gcab02e6 how-to/nose.html#noseintegration How to run tests written for nose :std:ref:`noseintegration`
nosestyle pytest 0.1.dev424+gcab02e6 how-to/nose.html#nosestyle Usage :std:ref:`nosestyle`
override fixtures pytest 0.1.dev424+gcab02e6 how-to/fixtures.html#override-fixtures Overriding fixtures on various levels :std:ref:`override fixtures`
parametrize pytest 0.1.dev424+gcab02e6 how-to/parametrize.html#parametrize How to parametrize fixtures and test functions :std:ref:`parametrize`
parametrize-basics pytest 0.1.dev424+gcab02e6 how-to/parametrize.html#parametrize-basics How to parametrize fixtures and test functions :std:ref:`parametrize-basics`
parametrized test functions pytest 0.1.dev424+gcab02e6 how-to/parametrize.html#parametrized-test-functions How to parametrize fixtures and test functions :std:ref:`parametrized test functions`
parametrizemark pytest 0.1.dev424+gcab02e6 how-to/parametrize.html#parametrizemark @pytest.mark.parametrize: parametrizing test functions :std:ref:`parametrizemark`
parametrizing-tests pytest 0.1.dev424+gcab02e6 how-to/parametrize.html#parametrizing-tests How to parametrize fixtures and test functions :std:ref:`parametrizing-tests`
parametrizing_conditional_raising pytest 0.1.dev424+gcab02e6 example/parametrize.html#parametrizing-conditional-raising Parametrizing conditional raising :std:ref:`parametrizing_conditional_raising`
paramexamples pytest 0.1.dev424+gcab02e6 example/parametrize.html#paramexamples Parametrizing tests :std:ref:`paramexamples`
passing callables to custom markers pytest 0.1.dev424+gcab02e6 example/markers.html#passing-callables-to-custom-markers Passing a callable to custom markers :std:ref:`passing callables to custom markers`
passing command-line string to pytest.main deprecated pytest 0.1.dev424+gcab02e6 deprecations.html#passing-command-line-string-to-pytest-main-deprecated Passing command-line string to pytest.main() :std:ref:`passing command-line string to pytest.main deprecated`
pdb-option pytest 0.1.dev424+gcab02e6 how-to/failures.html#pdb-option Using python:library/pdb with pytest :std:ref:`pdb-option`
pdb-unittest-note pytest 0.1.dev424+gcab02e6 how-to/unittest.html#pdb-unittest-note - :std:ref:`pdb-unittest-note`
pip-installable plugins pytest 0.1.dev424+gcab02e6 how-to/writing_plugins.html#pip-installable-plugins Making your plugin installable by others :std:ref:`pip-installable plugins`
plugin-hookorder pytest 0.1.dev424+gcab02e6 how-to/writing_hook_functions.html#plugin-hookorder Hook function ordering / call example :std:ref:`plugin-hookorder`
plugin-list pytest 0.1.dev424+gcab02e6 reference/plugin_list.html#plugin-list Plugin List :std:ref:`plugin-list`
plugin-stash pytest 0.1.dev424+gcab02e6 how-to/writing_hook_functions.html#plugin-stash Storing data on items across hook functions :std:ref:`plugin-stash`
pluginorder pytest 0.1.dev424+gcab02e6 how-to/writing_plugins.html#pluginorder Plugin discovery order at tool startup :std:ref:`pluginorder`
plugins pytest 0.1.dev424+gcab02e6 how-to/writing_plugins.html#plugins Writing plugins :std:ref:`plugins`
printdebugging pytest 0.1.dev424+gcab02e6 how-to/capture-stdout-stderr.html#printdebugging Using print statements for debugging :std:ref:`printdebugging`
pull requests pytest 0.1.dev424+gcab02e6 contributing.html#pull-requests Preparing Pull Requests :std:ref:`pull requests`
pull-requests pytest 0.1.dev424+gcab02e6 contributing.html#id1 Preparing Pull Requests :std:ref:`pull-requests`
py-modindex pytest 0.1.dev424+gcab02e6 py-modindex.html Python Module Index :std:ref:`py-modindex`
pytest current test env pytest 0.1.dev424+gcab02e6 example/simple.html#pytest-current-test-env PYTEST_CURRENT_TEST environment variable :std:ref:`pytest current test env`
pytest helpers pytest 0.1.dev424+gcab02e6 builtin.html#pytest-helpers Pytest API and builtin fixtures :std:ref:`pytest helpers`
pytest vs python -m pytest pytest 0.1.dev424+gcab02e6 explanation/pythonpath.html#pytest-vs-python-m-pytest Invoking pytest versus python -m pytest :std:ref:`pytest vs python -m pytest`
pytest.config global deprecated pytest 0.1.dev424+gcab02e6 deprecations.html#pytest-config-global-deprecated pytest.config global :std:ref:`pytest.config global deprecated`
pytest.detailed_failed_tests_usage pytest 0.1.dev424+gcab02e6 how-to/output.html#pytest-detailed-failed-tests-usage Producing a detailed summary report :std:ref:`pytest.detailed_failed_tests_usage`
pytest.fixture pytest 0.1.dev424+gcab02e6 reference/fixtures.html#id1 Fixtures reference :std:ref:`pytest.fixture`
pytest.fixture-api pytest 0.1.dev424+gcab02e6 reference/reference.html#pytest-fixture-api @pytest.fixture :std:ref:`pytest.fixture-api`
pytest.importorskip ref pytest 0.1.dev424+gcab02e6 reference/reference.html#pytest-importorskip-ref pytest.importorskip :std:ref:`pytest.importorskip ref`
pytest.main-usage pytest 0.1.dev424+gcab02e6 how-to/usage.html#pytest-main-usage Calling pytest from Python code :std:ref:`pytest.main-usage`
pytest.mark.filterwarnings ref pytest 0.1.dev424+gcab02e6 reference/reference.html#pytest-mark-filterwarnings-ref pytest.mark.filterwarnings :std:ref:`pytest.mark.filterwarnings ref`
pytest.mark.parametrize ref pytest 0.1.dev424+gcab02e6 reference/reference.html#pytest-mark-parametrize-ref pytest.mark.parametrize :std:ref:`pytest.mark.parametrize ref`
pytest.mark.skip ref pytest 0.1.dev424+gcab02e6 reference/reference.html#pytest-mark-skip-ref pytest.mark.skip :std:ref:`pytest.mark.skip ref`
pytest.mark.skipif ref pytest 0.1.dev424+gcab02e6 reference/reference.html#pytest-mark-skipif-ref pytest.mark.skipif :std:ref:`pytest.mark.skipif ref`
pytest.mark.usefixtures ref pytest 0.1.dev424+gcab02e6 reference/reference.html#pytest-mark-usefixtures-ref pytest.mark.usefixtures :std:ref:`pytest.mark.usefixtures ref`
pytest.mark.xfail ref pytest 0.1.dev424+gcab02e6 reference/reference.html#pytest-mark-xfail-ref pytest.mark.xfail :std:ref:`pytest.mark.xfail ref`
pytest.namespace deprecated pytest 0.1.dev424+gcab02e6 deprecations.html#pytest-namespace-deprecated pytest_namespace :std:ref:`pytest.namespace deprecated`
pytest_funcarg__ prefix deprecated pytest 0.1.dev424+gcab02e6 deprecations.html#pytest-funcarg-prefix-deprecated pytest_funcarg__ prefix :std:ref:`pytest_funcarg__ prefix deprecated`
pytest_generate_tests pytest 0.1.dev424+gcab02e6 how-to/parametrize.html#pytest-generate-tests Basic pytest_generate_tests example :std:ref:`pytest_generate_tests`
pytest_plugins in non-top-level conftest files deprecated pytest 0.1.dev424+gcab02e6 deprecations.html#pytest-plugins-in-non-top-level-conftest-files-deprecated pytest_plugins in non-top-level conftest files :std:ref:`pytest_plugins in non-top-level conftest files deprecated`
python test discovery pytest 0.1.dev424+gcab02e6 explanation/goodpractices.html#python-test-discovery Conventions for Python test discovery :std:ref:`python test discovery`
pythonpath pytest 0.1.dev424+gcab02e6 explanation/pythonpath.html#pythonpath pytest import mechanisms and sys.path/PYTHONPATH :std:ref:`pythonpath`
raises message deprecated pytest 0.1.dev424+gcab02e6 deprecations.html#raises-message-deprecated "message" parameter of pytest.raises :std:ref:`raises message deprecated`
raises-warns-exec pytest 0.1.dev424+gcab02e6 deprecations.html#raises-warns-exec raises / warns with a string as the second argument :std:ref:`raises-warns-exec`
record_property example pytest 0.1.dev424+gcab02e6 how-to/output.html#record-property-example record_property :std:ref:`record_property example`
record_testsuite_property example pytest 0.1.dev424+gcab02e6 how-to/output.html#record-testsuite-property-example record_testsuite_property :std:ref:`record_testsuite_property example`
record_xml_property deprecated pytest 0.1.dev424+gcab02e6 deprecations.html#record-xml-property-deprecated record_xml_property :std:ref:`record_xml_property deprecated`
recording warnings pytest 0.1.dev424+gcab02e6 how-to/capture-warnings.html#recording-warnings Recording warnings :std:ref:`recording warnings`
recwarn pytest 0.1.dev424+gcab02e6 how-to/capture-warnings.html#recwarn Recording warnings :std:ref:`recwarn`
reference pytest 0.1.dev424+gcab02e6 reference/index.html#reference Reference guides :std:ref:`reference`
reference-fixtures pytest 0.1.dev424+gcab02e6 reference/fixtures.html#reference-fixtures Fixtures reference :std:ref:`reference-fixtures`
registering-markers pytest 0.1.dev424+gcab02e6 how-to/writing_plugins.html#registering-markers Registering custom markers :std:ref:`registering-markers`
release-3.0.0 pytest 0.1.dev424+gcab02e6 changelog.html#release-3-0-0 3.0.0 (2016-08-18) :std:ref:`release-3.0.0`
reportbugs pytest 0.1.dev424+gcab02e6 contributing.html#reportbugs Report bugs :std:ref:`reportbugs`
request example pytest 0.1.dev424+gcab02e6 example/simple.html#request-example Pass different values to a test function, depending on command line options :std:ref:`request example`
request-context pytest 0.1.dev424+gcab02e6 how-to/fixtures.html#request-context Fixtures can introspect the requesting test context :std:ref:`request-context`
requiring plugins in non-root conftests pytest 0.1.dev424+gcab02e6 how-to/writing_plugins.html#requiring-plugins-in-non-root-conftests - :std:ref:`requiring plugins in non-root conftests`
resource-warnings pytest 0.1.dev424+gcab02e6 how-to/capture-warnings.html#resource-warnings Resource Warnings :std:ref:`resource-warnings`
resultlog deprecated pytest 0.1.dev424+gcab02e6 deprecations.html#resultlog-deprecated Result log (--result-log) :std:ref:`resultlog deprecated`
rootdir pytest 0.1.dev424+gcab02e6 reference/customize.html#rootdir Initialization: determining rootdir and configfile :std:ref:`rootdir`
safe fixture structure pytest 0.1.dev424+gcab02e6 how-to/fixtures.html#safe-fixture-structure Safe fixture structure :std:ref:`safe fixture structure`
safe teardowns pytest 0.1.dev424+gcab02e6 how-to/fixtures.html#safe-teardowns Safe teardowns :std:ref:`safe teardowns`
scoped-marking pytest 0.1.dev424+gcab02e6 example/markers.html#scoped-marking Marking whole classes or modules :std:ref:`scoped-marking`
search pytest 0.1.dev424+gcab02e6 search.html Search Page :std:ref:`search`
select-tests pytest 0.1.dev424+gcab02e6 how-to/usage.html#select-tests Specifying which tests to run :std:ref:`select-tests`
setuptools entry points pytest 0.1.dev424+gcab02e6 how-to/writing_plugins.html#setuptools-entry-points Making your plugin installable by others :std:ref:`setuptools entry points`
simpletest pytest 0.1.dev424+gcab02e6 getting-started.html#simpletest Create your first test :std:ref:`simpletest`
skip pytest 0.1.dev424+gcab02e6 how-to/skipping.html#skip Skipping test functions :std:ref:`skip`
skip and xfail pytest 0.1.dev424+gcab02e6 how-to/skipping.html#skip-and-xfail How to use skip and xfail to deal with tests that cannot succeed :std:ref:`skip and xfail`
skip/xfail with parametrize pytest 0.1.dev424+gcab02e6 how-to/skipping.html#skip-xfail-with-parametrize Skip/xfail with parametrize :std:ref:`skip/xfail with parametrize`
skipif pytest 0.1.dev424+gcab02e6 how-to/skipping.html#skipif Skipping test functions :std:ref:`skipif`
skipping pytest 0.1.dev424+gcab02e6 how-to/skipping.html#skipping How to use skip and xfail to deal with tests that cannot succeed :std:ref:`skipping`
smtpshared pytest 0.1.dev424+gcab02e6 how-to/fixtures.html#smtpshared Scope: sharing fixtures across classes, modules, packages or session :std:ref:`smtpshared`
src-layout pytest 0.1.dev424+gcab02e6 explanation/goodpractices.html#src-layout - :std:ref:`src-layout`
string conditions pytest 0.1.dev424+gcab02e6 historical-notes.html#string-conditions Conditions as strings instead of booleans :std:ref:`string conditions`
submitfeedback pytest 0.1.dev424+gcab02e6 contributing.html#submitfeedback Feature requests and feedback :std:ref:`submitfeedback`
submitplugin pytest 0.1.dev424+gcab02e6 contributing.html#submitplugin Submitting Plugins to pytest-dev :std:ref:`submitplugin`
tbreportdemo pytest 0.1.dev424+gcab02e6 example/reportingdemo.html#tbreportdemo Demo of Python failure reports with pytest :std:ref:`tbreportdemo`
test discovery pytest 0.1.dev424+gcab02e6 explanation/goodpractices.html#test-discovery Conventions for Python test discovery :std:ref:`test discovery`
test generators pytest 0.1.dev424+gcab02e6 how-to/parametrize.html#test-generators How to parametrize fixtures and test functions :std:ref:`test generators`
test package name pytest 0.1.dev424+gcab02e6 explanation/goodpractices.html#test-package-name - :std:ref:`test package name`
test-anatomy pytest 0.1.dev424+gcab02e6 explanation/anatomy.html#test-anatomy Anatomy of a test :std:ref:`test-anatomy`
tmp_path pytest 0.1.dev424+gcab02e6 how-to/tmp_path.html#tmp-path How to use temporary directories and files in tests :std:ref:`tmp_path`
tmp_path handling pytest 0.1.dev424+gcab02e6 how-to/tmp_path.html#tmp-path-handling How to use temporary directories and files in tests :std:ref:`tmp_path handling`
tmp_path_factory example pytest 0.1.dev424+gcab02e6 how-to/tmp_path.html#tmp-path-factory-example The tmp_path_factory fixture :std:ref:`tmp_path_factory example`
tmp_path_factory factory api pytest 0.1.dev424+gcab02e6 reference/reference.html#tmp-path-factory-factory-api - :std:ref:`tmp_path_factory factory api`
tmpdir pytest 0.1.dev424+gcab02e6 how-to/tmp_path.html#tmpdir The tmpdir and tmpdir_factory fixtures :std:ref:`tmpdir`
tmpdir and tmpdir_factory pytest 0.1.dev424+gcab02e6 how-to/tmp_path.html#tmpdir-and-tmpdir-factory The tmpdir and tmpdir_factory fixtures :std:ref:`tmpdir and tmpdir_factory`
toc pytest 0.1.dev424+gcab02e6 contents.html#toc Full pytest documentation :std:ref:`toc`
trace-option pytest 0.1.dev424+gcab02e6 how-to/failures.html#trace-option Dropping to pdb at the start of a test :std:ref:`trace-option`
uncooperative-constructors-deprecated pytest 0.1.dev424+gcab02e6 deprecations.html#uncooperative-constructors-deprecated Constructors of custom pytest.Node subclasses should take **kwargs :std:ref:`uncooperative-constructors-deprecated`
unittest pytest 0.1.dev424+gcab02e6 how-to/unittest.html#unittest How to use unittest-based tests with pytest :std:ref:`unittest`
unittest.testcase pytest 0.1.dev424+gcab02e6 how-to/unittest.html#unittest-testcase How to use unittest-based tests with pytest :std:ref:`unittest.testcase`
unknown-marks pytest 0.1.dev424+gcab02e6 how-to/mark.html#unknown-marks Raising errors on unknown marks :std:ref:`unknown-marks`
unraisable pytest 0.1.dev424+gcab02e6 how-to/failures.html#unraisable Warning about unraisable exceptions and unhandled thread exceptions :std:ref:`unraisable`
update marker code pytest 0.1.dev424+gcab02e6 historical-notes.html#update-marker-code Updating code :std:ref:`update marker code`
usage pytest 0.1.dev424+gcab02e6 how-to/usage.html#usage How to invoke pytest :std:ref:`usage`
use tox pytest 0.1.dev424+gcab02e6 explanation/goodpractices.html#use-tox tox :std:ref:`use tox`
usefixtures pytest 0.1.dev424+gcab02e6 how-to/fixtures.html#usefixtures Use fixtures in classes and modules with usefixtures :std:ref:`usefixtures`
using doctest options pytest 0.1.dev424+gcab02e6 how-to/doctest.html#using-doctest-options Using ‘doctest’ options :std:ref:`using doctest options`
using plugins pytest 0.1.dev424+gcab02e6 how-to/plugins.html#using-plugins How to install and use plugins :std:ref:`using plugins`
using-markers pytest 0.1.dev424+gcab02e6 how-to/fixtures.html#using-markers Using markers to pass data to fixtures :std:ref:`using-markers`
validation pytest 0.1.dev424+gcab02e6 how-to/writing_hook_functions.html#validation hook function validation and execution :std:ref:`validation`
version-tuple pytest 0.1.dev424+gcab02e6 reference/reference.html#version-tuple pytest.version_tuple :std:ref:`version-tuple`
warnings pytest 0.1.dev424+gcab02e6 how-to/capture-warnings.html#warnings How to capture warnings :std:ref:`warnings`
warnings ref pytest 0.1.dev424+gcab02e6 reference/reference.html#warnings-ref Warnings :std:ref:`warnings ref`
warns pytest 0.1.dev424+gcab02e6 how-to/capture-warnings.html#warns Asserting warnings with the warns function :std:ref:`warns`
warns use cases pytest 0.1.dev424+gcab02e6 how-to/capture-warnings.html#warns-use-cases Additional use cases of warnings in tests :std:ref:`warns use cases`
which-import-mode pytest 0.1.dev424+gcab02e6 explanation/goodpractices.html#which-import-mode Choosing an import mode :std:ref:`which-import-mode`
writeplugins pytest 0.1.dev424+gcab02e6 contributing.html#writeplugins Implement features :std:ref:`writeplugins`
writing-plugins pytest 0.1.dev424+gcab02e6 how-to/writing_plugins.html#writing-plugins Writing plugins :std:ref:`writing-plugins`
writinghooks pytest 0.1.dev424+gcab02e6 how-to/writing_hook_functions.html#writinghooks Writing hook functions :std:ref:`writinghooks`
xfail pytest 0.1.dev424+gcab02e6 how-to/skipping.html#xfail XFail: mark test functions as expected to fail :std:ref:`xfail`
xfail strict tutorial pytest 0.1.dev424+gcab02e6 how-to/skipping.html#xfail-strict-tutorial strict parameter :std:ref:`xfail strict tutorial`
xunit-method-setup pytest 0.1.dev424+gcab02e6 how-to/xunit_setup.html#xunit-method-setup Method and function level setup/teardown :std:ref:`xunit-method-setup`
xunitsetup pytest 0.1.dev424+gcab02e6 how-to/xunit_setup.html#xunitsetup How to implement xunit-style set-up :std:ref:`xunitsetup`
yaml plugin pytest 0.1.dev424+gcab02e6 example/nonpython.html#yaml-plugin A basic example for specifying tests in Yaml files :std:ref:`yaml plugin`
yield fixtures pytest 0.1.dev424+gcab02e6 how-to/fixtures.html#yield-fixtures 1. yield fixtures (recommended) :std:ref:`yield fixtures`
yield tests deprecated pytest 0.1.dev424+gcab02e6 deprecations.html#yield-tests-deprecated yield tests :std:ref:`yield tests deprecated`
yieldfixture pytest 0.1.dev424+gcab02e6 yieldfixture.html#yieldfixture “yield_fixture” functions :std:ref:`yieldfixture`

std:envvar

Identifier Project Name Version Location Display Name Usage example
FORCE_COLOR pytest 0.1.dev424+gcab02e6 reference/reference.html#envvar-FORCE_COLOR - :std:envvar:`FORCE_COLOR`
NO_COLOR pytest 0.1.dev424+gcab02e6 reference/reference.html#envvar-NO_COLOR - :std:envvar:`NO_COLOR`
PYTEST_ADDOPTS pytest 0.1.dev424+gcab02e6 reference/reference.html#envvar-PYTEST_ADDOPTS - :std:envvar:`PYTEST_ADDOPTS`
PYTEST_CURRENT_TEST pytest 0.1.dev424+gcab02e6 reference/reference.html#envvar-PYTEST_CURRENT_TEST - :std:envvar:`PYTEST_CURRENT_TEST`
PYTEST_DEBUG pytest 0.1.dev424+gcab02e6 reference/reference.html#envvar-PYTEST_DEBUG - :std:envvar:`PYTEST_DEBUG`
PYTEST_DISABLE_PLUGIN_AUTOLOAD pytest 0.1.dev424+gcab02e6 reference/reference.html#envvar-PYTEST_DISABLE_PLUGIN_AUTOLOAD - :std:envvar:`PYTEST_DISABLE_PLUGIN_AUTOLOAD`
PYTEST_PLUGINS pytest 0.1.dev424+gcab02e6 reference/reference.html#envvar-PYTEST_PLUGINS - :std:envvar:`PYTEST_PLUGINS`
PYTEST_THEME pytest 0.1.dev424+gcab02e6 reference/reference.html#envvar-PYTEST_THEME - :std:envvar:`PYTEST_THEME`
PYTEST_THEME_MODE pytest 0.1.dev424+gcab02e6 reference/reference.html#envvar-PYTEST_THEME_MODE - :std:envvar:`PYTEST_THEME_MODE`
PY_COLORS pytest 0.1.dev424+gcab02e6 reference/reference.html#envvar-PY_COLORS - :std:envvar:`PY_COLORS`

std:confval

Identifier Project Name Version Location Display Name Usage example
addopts pytest 0.1.dev424+gcab02e6 reference/reference.html#confval-addopts - :std:confval:`addopts`
cache_dir pytest 0.1.dev424+gcab02e6 reference/reference.html#confval-cache_dir - :std:confval:`cache_dir`
console_output_style pytest 0.1.dev424+gcab02e6 reference/reference.html#confval-console_output_style - :std:confval:`console_output_style`
doctest_encoding pytest 0.1.dev424+gcab02e6 reference/reference.html#confval-doctest_encoding - :std:confval:`doctest_encoding`
doctest_optionflags pytest 0.1.dev424+gcab02e6 reference/reference.html#confval-doctest_optionflags - :std:confval:`doctest_optionflags`
empty_parameter_set_mark pytest 0.1.dev424+gcab02e6 reference/reference.html#confval-empty_parameter_set_mark - :std:confval:`empty_parameter_set_mark`
faulthandler_timeout pytest 0.1.dev424+gcab02e6 reference/reference.html#confval-faulthandler_timeout - :std:confval:`faulthandler_timeout`
filterwarnings pytest 0.1.dev424+gcab02e6 reference/reference.html#confval-filterwarnings - :std:confval:`filterwarnings`
junit_duration_report pytest 0.1.dev424+gcab02e6 reference/reference.html#confval-junit_duration_report - :std:confval:`junit_duration_report`
junit_family pytest 0.1.dev424+gcab02e6 reference/reference.html#confval-junit_family - :std:confval:`junit_family`
junit_log_passing_tests pytest 0.1.dev424+gcab02e6 reference/reference.html#confval-junit_log_passing_tests - :std:confval:`junit_log_passing_tests`
junit_logging pytest 0.1.dev424+gcab02e6 reference/reference.html#confval-junit_logging - :std:confval:`junit_logging`
junit_suite_name pytest 0.1.dev424+gcab02e6 reference/reference.html#confval-junit_suite_name - :std:confval:`junit_suite_name`
log_auto_indent pytest 0.1.dev424+gcab02e6 reference/reference.html#confval-log_auto_indent - :std:confval:`log_auto_indent`
log_cli pytest 0.1.dev424+gcab02e6 reference/reference.html#confval-log_cli - :std:confval:`log_cli`
log_cli_date_format pytest 0.1.dev424+gcab02e6 reference/reference.html#confval-log_cli_date_format - :std:confval:`log_cli_date_format`
log_cli_format pytest 0.1.dev424+gcab02e6 reference/reference.html#confval-log_cli_format - :std:confval:`log_cli_format`
log_cli_level pytest 0.1.dev424+gcab02e6 reference/reference.html#confval-log_cli_level - :std:confval:`log_cli_level`
log_date_format pytest 0.1.dev424+gcab02e6 reference/reference.html#confval-log_date_format - :std:confval:`log_date_format`
log_file pytest 0.1.dev424+gcab02e6 reference/reference.html#confval-log_file - :std:confval:`log_file`
log_file_date_format pytest 0.1.dev424+gcab02e6 reference/reference.html#confval-log_file_date_format - :std:confval:`log_file_date_format`
log_file_format pytest 0.1.dev424+gcab02e6 reference/reference.html#confval-log_file_format - :std:confval:`log_file_format`
log_file_level pytest 0.1.dev424+gcab02e6 reference/reference.html#confval-log_file_level - :std:confval:`log_file_level`
log_format pytest 0.1.dev424+gcab02e6 reference/reference.html#confval-log_format - :std:confval:`log_format`
log_level pytest 0.1.dev424+gcab02e6 reference/reference.html#confval-log_level - :std:confval:`log_level`
markers pytest 0.1.dev424+gcab02e6 reference/reference.html#confval-markers - :std:confval:`markers`
minversion pytest 0.1.dev424+gcab02e6 reference/reference.html#confval-minversion - :std:confval:`minversion`
norecursedirs pytest 0.1.dev424+gcab02e6 reference/reference.html#confval-norecursedirs - :std:confval:`norecursedirs`
python_classes pytest 0.1.dev424+gcab02e6 reference/reference.html#confval-python_classes - :std:confval:`python_classes`
python_files pytest 0.1.dev424+gcab02e6 reference/reference.html#confval-python_files - :std:confval:`python_files`
python_functions pytest 0.1.dev424+gcab02e6 reference/reference.html#confval-python_functions - :std:confval:`python_functions`
pythonpath pytest 0.1.dev424+gcab02e6 reference/reference.html#confval-pythonpath - :std:confval:`pythonpath`
required_plugins pytest 0.1.dev424+gcab02e6 reference/reference.html#confval-required_plugins - :std:confval:`required_plugins`
testpaths pytest 0.1.dev424+gcab02e6 reference/reference.html#confval-testpaths - :std:confval:`testpaths`
tmp_path_retention_count pytest 0.1.dev424+gcab02e6 reference/reference.html#confval-tmp_path_retention_count - :std:confval:`tmp_path_retention_count`
tmp_path_retention_policy pytest 0.1.dev424+gcab02e6 reference/reference.html#confval-tmp_path_retention_policy - :std:confval:`tmp_path_retention_policy`
usefixtures pytest 0.1.dev424+gcab02e6 reference/reference.html#confval-usefixtures - :std:confval:`usefixtures`
xfail_strict pytest 0.1.dev424+gcab02e6 reference/reference.html#confval-xfail_strict - :std:confval:`xfail_strict`

std:doc

Identifier Project Name Version Location Display Name Usage example
adopt pytest 0.1.dev424+gcab02e6 adopt.html April 2015 is “adopt pytest month” :std:doc:`adopt`
announce/index pytest 0.1.dev424+gcab02e6 announce/index.html Release announcements :std:doc:`announce/index`
announce/release-2.0.0 pytest 0.1.dev424+gcab02e6 announce/release-2.0.0.html py.test 2.0.0: asserts++, unittest++, reporting++, config++, docs++ :std:doc:`announce/release-2.0.0`
announce/release-2.0.1 pytest 0.1.dev424+gcab02e6 announce/release-2.0.1.html py.test 2.0.1: bug fixes :std:doc:`announce/release-2.0.1`
announce/release-2.0.2 pytest 0.1.dev424+gcab02e6 announce/release-2.0.2.html py.test 2.0.2: bug fixes, improved xfail/skip expressions, speed ups :std:doc:`announce/release-2.0.2`
announce/release-2.0.3 pytest 0.1.dev424+gcab02e6 announce/release-2.0.3.html py.test 2.0.3: bug fixes and speed ups :std:doc:`announce/release-2.0.3`
announce/release-2.1.0 pytest 0.1.dev424+gcab02e6 announce/release-2.1.0.html py.test 2.1.0: perfected assertions and bug fixes :std:doc:`announce/release-2.1.0`
announce/release-2.1.1 pytest 0.1.dev424+gcab02e6 announce/release-2.1.1.html py.test 2.1.1: assertion fixes and improved junitxml output :std:doc:`announce/release-2.1.1`
announce/release-2.1.2 pytest 0.1.dev424+gcab02e6 announce/release-2.1.2.html py.test 2.1.2: bug fixes and fixes for jython :std:doc:`announce/release-2.1.2`
announce/release-2.1.3 pytest 0.1.dev424+gcab02e6 announce/release-2.1.3.html py.test 2.1.3: just some more fixes :std:doc:`announce/release-2.1.3`
announce/release-2.2.0 pytest 0.1.dev424+gcab02e6 announce/release-2.2.0.html py.test 2.2.0: test marking++, parametrization++ and duration profiling :std:doc:`announce/release-2.2.0`
announce/release-2.2.1 pytest 0.1.dev424+gcab02e6 announce/release-2.2.1.html pytest-2.2.1: bug fixes, perfect teardowns :std:doc:`announce/release-2.2.1`
announce/release-2.2.2 pytest 0.1.dev424+gcab02e6 announce/release-2.2.2.html pytest-2.2.2: bug fixes :std:doc:`announce/release-2.2.2`
announce/release-2.2.4 pytest 0.1.dev424+gcab02e6 announce/release-2.2.4.html pytest-2.2.4: bug fixes, better junitxml/unittest/python3 compat :std:doc:`announce/release-2.2.4`
announce/release-2.3.0 pytest 0.1.dev424+gcab02e6 announce/release-2.3.0.html pytest-2.3: improved fixtures / better unittest integration :std:doc:`announce/release-2.3.0`
announce/release-2.3.1 pytest 0.1.dev424+gcab02e6 announce/release-2.3.1.html pytest-2.3.1: fix regression with factory functions :std:doc:`announce/release-2.3.1`
announce/release-2.3.2 pytest 0.1.dev424+gcab02e6 announce/release-2.3.2.html pytest-2.3.2: some fixes and more traceback-printing speed :std:doc:`announce/release-2.3.2`
announce/release-2.3.3 pytest 0.1.dev424+gcab02e6 announce/release-2.3.3.html pytest-2.3.3: integration fixes, py24 support, */** shown in traceback :std:doc:`announce/release-2.3.3`
announce/release-2.3.4 pytest 0.1.dev424+gcab02e6 announce/release-2.3.4.html pytest-2.3.4: stabilization, more flexible selection via “-k expr” :std:doc:`announce/release-2.3.4`
announce/release-2.3.5 pytest 0.1.dev424+gcab02e6 announce/release-2.3.5.html pytest-2.3.5: bug fixes and little improvements :std:doc:`announce/release-2.3.5`
announce/release-2.4.0 pytest 0.1.dev424+gcab02e6 announce/release-2.4.0.html pytest-2.4.0: new fixture features/hooks and bug fixes :std:doc:`announce/release-2.4.0`
announce/release-2.4.1 pytest 0.1.dev424+gcab02e6 announce/release-2.4.1.html pytest-2.4.1: fixing three regressions compared to 2.3.5 :std:doc:`announce/release-2.4.1`
announce/release-2.4.2 pytest 0.1.dev424+gcab02e6 announce/release-2.4.2.html pytest-2.4.2: colorama on windows, plugin/tmpdir fixes :std:doc:`announce/release-2.4.2`
announce/release-2.5.0 pytest 0.1.dev424+gcab02e6 announce/release-2.5.0.html pytest-2.5.0: now down to ZERO reported bugs! :std:doc:`announce/release-2.5.0`
announce/release-2.5.1 pytest 0.1.dev424+gcab02e6 announce/release-2.5.1.html pytest-2.5.1: fixes and new home page styling :std:doc:`announce/release-2.5.1`
announce/release-2.5.2 pytest 0.1.dev424+gcab02e6 announce/release-2.5.2.html pytest-2.5.2: fixes :std:doc:`announce/release-2.5.2`
announce/release-2.6.0 pytest 0.1.dev424+gcab02e6 announce/release-2.6.0.html pytest-2.6.0: shorter tracebacks, new warning system, test runner compat :std:doc:`announce/release-2.6.0`
announce/release-2.6.1 pytest 0.1.dev424+gcab02e6 announce/release-2.6.1.html pytest-2.6.1: fixes and new xfail feature :std:doc:`announce/release-2.6.1`
announce/release-2.6.2 pytest 0.1.dev424+gcab02e6 announce/release-2.6.2.html pytest-2.6.2: few fixes and cx_freeze support :std:doc:`announce/release-2.6.2`
announce/release-2.6.3 pytest 0.1.dev424+gcab02e6 announce/release-2.6.3.html pytest-2.6.3: fixes and little improvements :std:doc:`announce/release-2.6.3`
announce/release-2.7.0 pytest 0.1.dev424+gcab02e6 announce/release-2.7.0.html pytest-2.7.0: fixes, features, speed improvements :std:doc:`announce/release-2.7.0`
announce/release-2.7.1 pytest 0.1.dev424+gcab02e6 announce/release-2.7.1.html pytest-2.7.1: bug fixes :std:doc:`announce/release-2.7.1`
announce/release-2.7.2 pytest 0.1.dev424+gcab02e6 announce/release-2.7.2.html pytest-2.7.2: bug fixes :std:doc:`announce/release-2.7.2`
announce/release-2.8.2 pytest 0.1.dev424+gcab02e6 announce/release-2.8.2.html pytest-2.8.2: bug fixes :std:doc:`announce/release-2.8.2`
announce/release-2.8.3 pytest 0.1.dev424+gcab02e6 announce/release-2.8.3.html pytest-2.8.3: bug fixes :std:doc:`announce/release-2.8.3`
announce/release-2.8.4 pytest 0.1.dev424+gcab02e6 announce/release-2.8.4.html pytest-2.8.4 :std:doc:`announce/release-2.8.4`
announce/release-2.8.5 pytest 0.1.dev424+gcab02e6 announce/release-2.8.5.html pytest-2.8.5 :std:doc:`announce/release-2.8.5`
announce/release-2.8.6 pytest 0.1.dev424+gcab02e6 announce/release-2.8.6.html pytest-2.8.6 :std:doc:`announce/release-2.8.6`
announce/release-2.8.7 pytest 0.1.dev424+gcab02e6 announce/release-2.8.7.html pytest-2.8.7 :std:doc:`announce/release-2.8.7`
announce/release-2.9.0 pytest 0.1.dev424+gcab02e6 announce/release-2.9.0.html pytest-2.9.0 :std:doc:`announce/release-2.9.0`
announce/release-2.9.1 pytest 0.1.dev424+gcab02e6 announce/release-2.9.1.html pytest-2.9.1 :std:doc:`announce/release-2.9.1`
announce/release-2.9.2 pytest 0.1.dev424+gcab02e6 announce/release-2.9.2.html pytest-2.9.2 :std:doc:`announce/release-2.9.2`
announce/release-3.0.0 pytest 0.1.dev424+gcab02e6 announce/release-3.0.0.html pytest-3.0.0 :std:doc:`announce/release-3.0.0`
announce/release-3.0.1 pytest 0.1.dev424+gcab02e6 announce/release-3.0.1.html pytest-3.0.1 :std:doc:`announce/release-3.0.1`
announce/release-3.0.2 pytest 0.1.dev424+gcab02e6 announce/release-3.0.2.html pytest-3.0.2 :std:doc:`announce/release-3.0.2`
announce/release-3.0.3 pytest 0.1.dev424+gcab02e6 announce/release-3.0.3.html pytest-3.0.3 :std:doc:`announce/release-3.0.3`
announce/release-3.0.4 pytest 0.1.dev424+gcab02e6 announce/release-3.0.4.html pytest-3.0.4 :std:doc:`announce/release-3.0.4`
announce/release-3.0.5 pytest 0.1.dev424+gcab02e6 announce/release-3.0.5.html pytest-3.0.5 :std:doc:`announce/release-3.0.5`
announce/release-3.0.6 pytest 0.1.dev424+gcab02e6 announce/release-3.0.6.html pytest-3.0.6 :std:doc:`announce/release-3.0.6`
announce/release-3.0.7 pytest 0.1.dev424+gcab02e6 announce/release-3.0.7.html pytest-3.0.7 :std:doc:`announce/release-3.0.7`
announce/release-3.1.0 pytest 0.1.dev424+gcab02e6 announce/release-3.1.0.html pytest-3.1.0 :std:doc:`announce/release-3.1.0`
announce/release-3.1.1 pytest 0.1.dev424+gcab02e6 announce/release-3.1.1.html pytest-3.1.1 :std:doc:`announce/release-3.1.1`
announce/release-3.1.2 pytest 0.1.dev424+gcab02e6 announce/release-3.1.2.html pytest-3.1.2 :std:doc:`announce/release-3.1.2`
announce/release-3.1.3 pytest 0.1.dev424+gcab02e6 announce/release-3.1.3.html pytest-3.1.3 :std:doc:`announce/release-3.1.3`
announce/release-3.10.0 pytest 0.1.dev424+gcab02e6 announce/release-3.10.0.html pytest-3.10.0 :std:doc:`announce/release-3.10.0`
announce/release-3.10.1 pytest 0.1.dev424+gcab02e6 announce/release-3.10.1.html pytest-3.10.1 :std:doc:`announce/release-3.10.1`
announce/release-3.2.0 pytest 0.1.dev424+gcab02e6 announce/release-3.2.0.html pytest-3.2.0 :std:doc:`announce/release-3.2.0`
announce/release-3.2.1 pytest 0.1.dev424+gcab02e6 announce/release-3.2.1.html pytest-3.2.1 :std:doc:`announce/release-3.2.1`
announce/release-3.2.2 pytest 0.1.dev424+gcab02e6 announce/release-3.2.2.html pytest-3.2.2 :std:doc:`announce/release-3.2.2`
announce/release-3.2.3 pytest 0.1.dev424+gcab02e6 announce/release-3.2.3.html pytest-3.2.3 :std:doc:`announce/release-3.2.3`
announce/release-3.2.4 pytest 0.1.dev424+gcab02e6 announce/release-3.2.4.html pytest-3.2.4 :std:doc:`announce/release-3.2.4`
announce/release-3.2.5 pytest 0.1.dev424+gcab02e6 announce/release-3.2.5.html pytest-3.2.5 :std:doc:`announce/release-3.2.5`
announce/release-3.3.0 pytest 0.1.dev424+gcab02e6 announce/release-3.3.0.html pytest-3.3.0 :std:doc:`announce/release-3.3.0`
announce/release-3.3.1 pytest 0.1.dev424+gcab02e6 announce/release-3.3.1.html pytest-3.3.1 :std:doc:`announce/release-3.3.1`
announce/release-3.3.2 pytest 0.1.dev424+gcab02e6 announce/release-3.3.2.html pytest-3.3.2 :std:doc:`announce/release-3.3.2`
announce/release-3.4.0 pytest 0.1.dev424+gcab02e6 announce/release-3.4.0.html pytest-3.4.0 :std:doc:`announce/release-3.4.0`
announce/release-3.4.1 pytest 0.1.dev424+gcab02e6 announce/release-3.4.1.html pytest-3.4.1 :std:doc:`announce/release-3.4.1`
announce/release-3.4.2 pytest 0.1.dev424+gcab02e6 announce/release-3.4.2.html pytest-3.4.2 :std:doc:`announce/release-3.4.2`
announce/release-3.5.0 pytest 0.1.dev424+gcab02e6 announce/release-3.5.0.html pytest-3.5.0 :std:doc:`announce/release-3.5.0`
announce/release-3.5.1 pytest 0.1.dev424+gcab02e6 announce/release-3.5.1.html pytest-3.5.1 :std:doc:`announce/release-3.5.1`
announce/release-3.6.0 pytest 0.1.dev424+gcab02e6 announce/release-3.6.0.html pytest-3.6.0 :std:doc:`announce/release-3.6.0`
announce/release-3.6.1 pytest 0.1.dev424+gcab02e6 announce/release-3.6.1.html pytest-3.6.1 :std:doc:`announce/release-3.6.1`
announce/release-3.6.2 pytest 0.1.dev424+gcab02e6 announce/release-3.6.2.html pytest-3.6.2 :std:doc:`announce/release-3.6.2`
announce/release-3.6.3 pytest 0.1.dev424+gcab02e6 announce/release-3.6.3.html pytest-3.6.3 :std:doc:`announce/release-3.6.3`
announce/release-3.6.4 pytest 0.1.dev424+gcab02e6 announce/release-3.6.4.html pytest-3.6.4 :std:doc:`announce/release-3.6.4`
announce/release-3.7.0 pytest 0.1.dev424+gcab02e6 announce/release-3.7.0.html pytest-3.7.0 :std:doc:`announce/release-3.7.0`
announce/release-3.7.1 pytest 0.1.dev424+gcab02e6 announce/release-3.7.1.html pytest-3.7.1 :std:doc:`announce/release-3.7.1`
announce/release-3.7.2 pytest 0.1.dev424+gcab02e6 announce/release-3.7.2.html pytest-3.7.2 :std:doc:`announce/release-3.7.2`
announce/release-3.7.3 pytest 0.1.dev424+gcab02e6 announce/release-3.7.3.html pytest-3.7.3 :std:doc:`announce/release-3.7.3`
announce/release-3.7.4 pytest 0.1.dev424+gcab02e6 announce/release-3.7.4.html pytest-3.7.4 :std:doc:`announce/release-3.7.4`
announce/release-3.8.0 pytest 0.1.dev424+gcab02e6 announce/release-3.8.0.html pytest-3.8.0 :std:doc:`announce/release-3.8.0`
announce/release-3.8.1 pytest 0.1.dev424+gcab02e6 announce/release-3.8.1.html pytest-3.8.1 :std:doc:`announce/release-3.8.1`
announce/release-3.8.2 pytest 0.1.dev424+gcab02e6 announce/release-3.8.2.html pytest-3.8.2 :std:doc:`announce/release-3.8.2`
announce/release-3.9.0 pytest 0.1.dev424+gcab02e6 announce/release-3.9.0.html pytest-3.9.0 :std:doc:`announce/release-3.9.0`
announce/release-3.9.1 pytest 0.1.dev424+gcab02e6 announce/release-3.9.1.html pytest-3.9.1 :std:doc:`announce/release-3.9.1`
announce/release-3.9.2 pytest 0.1.dev424+gcab02e6 announce/release-3.9.2.html pytest-3.9.2 :std:doc:`announce/release-3.9.2`
announce/release-3.9.3 pytest 0.1.dev424+gcab02e6 announce/release-3.9.3.html pytest-3.9.3 :std:doc:`announce/release-3.9.3`
announce/release-4.0.0 pytest 0.1.dev424+gcab02e6 announce/release-4.0.0.html pytest-4.0.0 :std:doc:`announce/release-4.0.0`
announce/release-4.0.1 pytest 0.1.dev424+gcab02e6 announce/release-4.0.1.html pytest-4.0.1 :std:doc:`announce/release-4.0.1`
announce/release-4.0.2 pytest 0.1.dev424+gcab02e6 announce/release-4.0.2.html pytest-4.0.2 :std:doc:`announce/release-4.0.2`
announce/release-4.1.0 pytest 0.1.dev424+gcab02e6 announce/release-4.1.0.html pytest-4.1.0 :std:doc:`announce/release-4.1.0`
announce/release-4.1.1 pytest 0.1.dev424+gcab02e6 announce/release-4.1.1.html pytest-4.1.1 :std:doc:`announce/release-4.1.1`
announce/release-4.2.0 pytest 0.1.dev424+gcab02e6 announce/release-4.2.0.html pytest-4.2.0 :std:doc:`announce/release-4.2.0`
announce/release-4.2.1 pytest 0.1.dev424+gcab02e6 announce/release-4.2.1.html pytest-4.2.1 :std:doc:`announce/release-4.2.1`
announce/release-4.3.0 pytest 0.1.dev424+gcab02e6 announce/release-4.3.0.html pytest-4.3.0 :std:doc:`announce/release-4.3.0`
announce/release-4.3.1 pytest 0.1.dev424+gcab02e6 announce/release-4.3.1.html pytest-4.3.1 :std:doc:`announce/release-4.3.1`
announce/release-4.4.0 pytest 0.1.dev424+gcab02e6 announce/release-4.4.0.html pytest-4.4.0 :std:doc:`announce/release-4.4.0`
announce/release-4.4.1 pytest 0.1.dev424+gcab02e6 announce/release-4.4.1.html pytest-4.4.1 :std:doc:`announce/release-4.4.1`
announce/release-4.4.2 pytest 0.1.dev424+gcab02e6 announce/release-4.4.2.html pytest-4.4.2 :std:doc:`announce/release-4.4.2`
announce/release-4.5.0 pytest 0.1.dev424+gcab02e6 announce/release-4.5.0.html pytest-4.5.0 :std:doc:`announce/release-4.5.0`
announce/release-4.6.0 pytest 0.1.dev424+gcab02e6 announce/release-4.6.0.html pytest-4.6.0 :std:doc:`announce/release-4.6.0`
announce/release-4.6.1 pytest 0.1.dev424+gcab02e6 announce/release-4.6.1.html pytest-4.6.1 :std:doc:`announce/release-4.6.1`
announce/release-4.6.2 pytest 0.1.dev424+gcab02e6 announce/release-4.6.2.html pytest-4.6.2 :std:doc:`announce/release-4.6.2`
announce/release-4.6.3 pytest 0.1.dev424+gcab02e6 announce/release-4.6.3.html pytest-4.6.3 :std:doc:`announce/release-4.6.3`
announce/release-4.6.4 pytest 0.1.dev424+gcab02e6 announce/release-4.6.4.html pytest-4.6.4 :std:doc:`announce/release-4.6.4`
announce/release-4.6.5 pytest 0.1.dev424+gcab02e6 announce/release-4.6.5.html pytest-4.6.5 :std:doc:`announce/release-4.6.5`
announce/release-4.6.6 pytest 0.1.dev424+gcab02e6 announce/release-4.6.6.html pytest-4.6.6 :std:doc:`announce/release-4.6.6`
announce/release-4.6.7 pytest 0.1.dev424+gcab02e6 announce/release-4.6.7.html pytest-4.6.7 :std:doc:`announce/release-4.6.7`
announce/release-4.6.8 pytest 0.1.dev424+gcab02e6 announce/release-4.6.8.html pytest-4.6.8 :std:doc:`announce/release-4.6.8`
announce/release-4.6.9 pytest 0.1.dev424+gcab02e6 announce/release-4.6.9.html pytest-4.6.9 :std:doc:`announce/release-4.6.9`
announce/release-5.0.0 pytest 0.1.dev424+gcab02e6 announce/release-5.0.0.html pytest-5.0.0 :std:doc:`announce/release-5.0.0`
announce/release-5.0.1 pytest 0.1.dev424+gcab02e6 announce/release-5.0.1.html pytest-5.0.1 :std:doc:`announce/release-5.0.1`
announce/release-5.1.0 pytest 0.1.dev424+gcab02e6 announce/release-5.1.0.html pytest-5.1.0 :std:doc:`announce/release-5.1.0`
announce/release-5.1.1 pytest 0.1.dev424+gcab02e6 announce/release-5.1.1.html pytest-5.1.1 :std:doc:`announce/release-5.1.1`
announce/release-5.1.2 pytest 0.1.dev424+gcab02e6 announce/release-5.1.2.html pytest-5.1.2 :std:doc:`announce/release-5.1.2`
announce/release-5.1.3 pytest 0.1.dev424+gcab02e6 announce/release-5.1.3.html pytest-5.1.3 :std:doc:`announce/release-5.1.3`
announce/release-5.2.0 pytest 0.1.dev424+gcab02e6 announce/release-5.2.0.html pytest-5.2.0 :std:doc:`announce/release-5.2.0`
announce/release-5.2.1 pytest 0.1.dev424+gcab02e6 announce/release-5.2.1.html pytest-5.2.1 :std:doc:`announce/release-5.2.1`
announce/release-5.2.2 pytest 0.1.dev424+gcab02e6 announce/release-5.2.2.html pytest-5.2.2 :std:doc:`announce/release-5.2.2`
announce/release-5.2.3 pytest 0.1.dev424+gcab02e6 announce/release-5.2.3.html pytest-5.2.3 :std:doc:`announce/release-5.2.3`
announce/release-5.2.4 pytest 0.1.dev424+gcab02e6 announce/release-5.2.4.html pytest-5.2.4 :std:doc:`announce/release-5.2.4`
announce/release-5.3.0 pytest 0.1.dev424+gcab02e6 announce/release-5.3.0.html pytest-5.3.0 :std:doc:`announce/release-5.3.0`
announce/release-5.3.1 pytest 0.1.dev424+gcab02e6 announce/release-5.3.1.html pytest-5.3.1 :std:doc:`announce/release-5.3.1`
announce/release-5.3.2 pytest 0.1.dev424+gcab02e6 announce/release-5.3.2.html pytest-5.3.2 :std:doc:`announce/release-5.3.2`
announce/release-5.3.3 pytest 0.1.dev424+gcab02e6 announce/release-5.3.3.html pytest-5.3.3 :std:doc:`announce/release-5.3.3`
announce/release-5.3.4 pytest 0.1.dev424+gcab02e6 announce/release-5.3.4.html pytest-5.3.4 :std:doc:`announce/release-5.3.4`
announce/release-5.3.5 pytest 0.1.dev424+gcab02e6 announce/release-5.3.5.html pytest-5.3.5 :std:doc:`announce/release-5.3.5`
announce/release-5.4.0 pytest 0.1.dev424+gcab02e6 announce/release-5.4.0.html pytest-5.4.0 :std:doc:`announce/release-5.4.0`
announce/release-5.4.1 pytest 0.1.dev424+gcab02e6 announce/release-5.4.1.html pytest-5.4.1 :std:doc:`announce/release-5.4.1`
announce/release-5.4.2 pytest 0.1.dev424+gcab02e6 announce/release-5.4.2.html pytest-5.4.2 :std:doc:`announce/release-5.4.2`
announce/release-5.4.3 pytest 0.1.dev424+gcab02e6 announce/release-5.4.3.html pytest-5.4.3 :std:doc:`announce/release-5.4.3`
announce/release-6.0.0 pytest 0.1.dev424+gcab02e6 announce/release-6.0.0.html pytest-6.0.0 :std:doc:`announce/release-6.0.0`
announce/release-6.0.0rc1 pytest 0.1.dev424+gcab02e6 announce/release-6.0.0rc1.html pytest-6.0.0rc1 :std:doc:`announce/release-6.0.0rc1`
announce/release-6.0.1 pytest 0.1.dev424+gcab02e6 announce/release-6.0.1.html pytest-6.0.1 :std:doc:`announce/release-6.0.1`
announce/release-6.0.2 pytest 0.1.dev424+gcab02e6 announce/release-6.0.2.html pytest-6.0.2 :std:doc:`announce/release-6.0.2`
announce/release-6.1.0 pytest 0.1.dev424+gcab02e6 announce/release-6.1.0.html pytest-6.1.0 :std:doc:`announce/release-6.1.0`
announce/release-6.1.1 pytest 0.1.dev424+gcab02e6 announce/release-6.1.1.html pytest-6.1.1 :std:doc:`announce/release-6.1.1`
announce/release-6.1.2 pytest 0.1.dev424+gcab02e6 announce/release-6.1.2.html pytest-6.1.2 :std:doc:`announce/release-6.1.2`
announce/release-6.2.0 pytest 0.1.dev424+gcab02e6 announce/release-6.2.0.html pytest-6.2.0 :std:doc:`announce/release-6.2.0`
announce/release-6.2.1 pytest 0.1.dev424+gcab02e6 announce/release-6.2.1.html pytest-6.2.1 :std:doc:`announce/release-6.2.1`
announce/release-6.2.2 pytest 0.1.dev424+gcab02e6 announce/release-6.2.2.html pytest-6.2.2 :std:doc:`announce/release-6.2.2`
announce/release-6.2.3 pytest 0.1.dev424+gcab02e6 announce/release-6.2.3.html pytest-6.2.3 :std:doc:`announce/release-6.2.3`
announce/release-6.2.4 pytest 0.1.dev424+gcab02e6 announce/release-6.2.4.html pytest-6.2.4 :std:doc:`announce/release-6.2.4`
announce/release-6.2.5 pytest 0.1.dev424+gcab02e6 announce/release-6.2.5.html pytest-6.2.5 :std:doc:`announce/release-6.2.5`
announce/release-7.0.0 pytest 0.1.dev424+gcab02e6 announce/release-7.0.0.html pytest-7.0.0 :std:doc:`announce/release-7.0.0`
announce/release-7.0.0rc1 pytest 0.1.dev424+gcab02e6 announce/release-7.0.0rc1.html pytest-7.0.0rc1 :std:doc:`announce/release-7.0.0rc1`
announce/release-7.0.1 pytest 0.1.dev424+gcab02e6 announce/release-7.0.1.html pytest-7.0.1 :std:doc:`announce/release-7.0.1`
announce/release-7.1.0 pytest 0.1.dev424+gcab02e6 announce/release-7.1.0.html pytest-7.1.0 :std:doc:`announce/release-7.1.0`
announce/release-7.1.1 pytest 0.1.dev424+gcab02e6 announce/release-7.1.1.html pytest-7.1.1 :std:doc:`announce/release-7.1.1`
announce/release-7.1.2 pytest 0.1.dev424+gcab02e6 announce/release-7.1.2.html pytest-7.1.2 :std:doc:`announce/release-7.1.2`
announce/release-7.1.3 pytest 0.1.dev424+gcab02e6 announce/release-7.1.3.html pytest-7.1.3 :std:doc:`announce/release-7.1.3`
announce/release-7.2.0 pytest 0.1.dev424+gcab02e6 announce/release-7.2.0.html pytest-7.2.0 :std:doc:`announce/release-7.2.0`
announce/sprint2016 pytest 0.1.dev424+gcab02e6 announce/sprint2016.html python testing sprint June 20th-26th 2016 :std:doc:`announce/sprint2016`
backwards-compatibility pytest 0.1.dev424+gcab02e6 backwards-compatibility.html Backwards Compatibility Policy :std:doc:`backwards-compatibility`
builtin pytest 0.1.dev424+gcab02e6 builtin.html Pytest API and builtin fixtures :std:doc:`builtin`
changelog pytest 0.1.dev424+gcab02e6 changelog.html Changelog :std:doc:`changelog`
contact pytest 0.1.dev424+gcab02e6 contact.html Contact channels :std:doc:`contact`
contents pytest 0.1.dev424+gcab02e6 contents.html Full pytest documentation :std:doc:`contents`
contributing pytest 0.1.dev424+gcab02e6 contributing.html Contribution getting started :std:doc:`contributing`
deprecations pytest 0.1.dev424+gcab02e6 deprecations.html Deprecations and Removals :std:doc:`deprecations`
development_guide pytest 0.1.dev424+gcab02e6 development_guide.html Development Guide :std:doc:`development_guide`
example/index pytest 0.1.dev424+gcab02e6 example/index.html Examples and customization tricks :std:doc:`example/index`
example/markers pytest 0.1.dev424+gcab02e6 example/markers.html Working with custom markers :std:doc:`example/markers`
example/nonpython pytest 0.1.dev424+gcab02e6 example/nonpython.html Working with non-python tests :std:doc:`example/nonpython`
example/parametrize pytest 0.1.dev424+gcab02e6 example/parametrize.html Parametrizing tests :std:doc:`example/parametrize`
example/pythoncollection pytest 0.1.dev424+gcab02e6 example/pythoncollection.html Changing standard (Python) test discovery :std:doc:`example/pythoncollection`
example/reportingdemo pytest 0.1.dev424+gcab02e6 example/reportingdemo.html Demo of Python failure reports with pytest :std:doc:`example/reportingdemo`
example/simple pytest 0.1.dev424+gcab02e6 example/simple.html Basic patterns and examples :std:doc:`example/simple`
example/special pytest 0.1.dev424+gcab02e6 example/special.html A session-fixture which can look at all collected tests :std:doc:`example/special`
explanation/anatomy pytest 0.1.dev424+gcab02e6 explanation/anatomy.html Anatomy of a test :std:doc:`explanation/anatomy`
explanation/fixtures pytest 0.1.dev424+gcab02e6 explanation/fixtures.html About fixtures :std:doc:`explanation/fixtures`
explanation/flaky pytest 0.1.dev424+gcab02e6 explanation/flaky.html Flaky tests :std:doc:`explanation/flaky`
explanation/goodpractices pytest 0.1.dev424+gcab02e6 explanation/goodpractices.html Good Integration Practices :std:doc:`explanation/goodpractices`
explanation/index pytest 0.1.dev424+gcab02e6 explanation/index.html Explanation :std:doc:`explanation/index`
explanation/pythonpath pytest 0.1.dev424+gcab02e6 explanation/pythonpath.html pytest import mechanisms and sys.path/PYTHONPATH :std:doc:`explanation/pythonpath`
funcarg_compare pytest 0.1.dev424+gcab02e6 funcarg_compare.html pytest-2.3: reasoning for fixture/funcarg evolution :std:doc:`funcarg_compare`
getting-started pytest 0.1.dev424+gcab02e6 getting-started.html Get Started :std:doc:`getting-started`
historical-notes pytest 0.1.dev424+gcab02e6 historical-notes.html Historical Notes :std:doc:`historical-notes`
history pytest 0.1.dev424+gcab02e6 history.html History :std:doc:`history`
how-to/assert pytest 0.1.dev424+gcab02e6 how-to/assert.html How to write and report assertions in tests :std:doc:`how-to/assert`
how-to/bash-completion pytest 0.1.dev424+gcab02e6 how-to/bash-completion.html How to set up bash completion :std:doc:`how-to/bash-completion`
how-to/cache pytest 0.1.dev424+gcab02e6 how-to/cache.html How to re-run failed tests and maintain state between test runs :std:doc:`how-to/cache`
how-to/capture-stdout-stderr pytest 0.1.dev424+gcab02e6 how-to/capture-stdout-stderr.html How to capture stdout/stderr output :std:doc:`how-to/capture-stdout-stderr`
how-to/capture-warnings pytest 0.1.dev424+gcab02e6 how-to/capture-warnings.html How to capture warnings :std:doc:`how-to/capture-warnings`
how-to/doctest pytest 0.1.dev424+gcab02e6 how-to/doctest.html How to run doctests :std:doc:`how-to/doctest`
how-to/existingtestsuite pytest 0.1.dev424+gcab02e6 how-to/existingtestsuite.html How to use pytest with an existing test suite :std:doc:`how-to/existingtestsuite`
how-to/failures pytest 0.1.dev424+gcab02e6 how-to/failures.html How to handle test failures :std:doc:`how-to/failures`
how-to/fixtures pytest 0.1.dev424+gcab02e6 how-to/fixtures.html How to use fixtures :std:doc:`how-to/fixtures`
how-to/index pytest 0.1.dev424+gcab02e6 how-to/index.html How-to guides :std:doc:`how-to/index`
how-to/logging pytest 0.1.dev424+gcab02e6 how-to/logging.html How to manage logging :std:doc:`how-to/logging`
how-to/mark pytest 0.1.dev424+gcab02e6 how-to/mark.html How to mark test functions with attributes :std:doc:`how-to/mark`
how-to/monkeypatch pytest 0.1.dev424+gcab02e6 how-to/monkeypatch.html How to monkeypatch/mock modules and environments :std:doc:`how-to/monkeypatch`
how-to/nose pytest 0.1.dev424+gcab02e6 how-to/nose.html How to run tests written for nose :std:doc:`how-to/nose`
how-to/output pytest 0.1.dev424+gcab02e6 how-to/output.html Managing pytest’s output :std:doc:`how-to/output`
how-to/parametrize pytest 0.1.dev424+gcab02e6 how-to/parametrize.html How to parametrize fixtures and test functions :std:doc:`how-to/parametrize`
how-to/plugins pytest 0.1.dev424+gcab02e6 how-to/plugins.html How to install and use plugins :std:doc:`how-to/plugins`
how-to/skipping pytest 0.1.dev424+gcab02e6 how-to/skipping.html How to use skip and xfail to deal with tests that cannot succeed :std:doc:`how-to/skipping`
how-to/tmp_path pytest 0.1.dev424+gcab02e6 how-to/tmp_path.html How to use temporary directories and files in tests :std:doc:`how-to/tmp_path`
how-to/unittest pytest 0.1.dev424+gcab02e6 how-to/unittest.html How to use unittest-based tests with pytest :std:doc:`how-to/unittest`
how-to/usage pytest 0.1.dev424+gcab02e6 how-to/usage.html How to invoke pytest :std:doc:`how-to/usage`
how-to/writing_hook_functions pytest 0.1.dev424+gcab02e6 how-to/writing_hook_functions.html Writing hook functions :std:doc:`how-to/writing_hook_functions`
how-to/writing_plugins pytest 0.1.dev424+gcab02e6 how-to/writing_plugins.html Writing plugins :std:doc:`how-to/writing_plugins`
how-to/xunit_setup pytest 0.1.dev424+gcab02e6 how-to/xunit_setup.html How to implement xunit-style set-up :std:doc:`how-to/xunit_setup`
index pytest 0.1.dev424+gcab02e6 index.html pytest: helps you write better programs :std:doc:`index`
license pytest 0.1.dev424+gcab02e6 license.html License :std:doc:`license`
proposals/parametrize_with_fixtures pytest 0.1.dev424+gcab02e6 proposals/parametrize_with_fixtures.html PROPOSAL: Parametrize with fixtures :std:doc:`proposals/parametrize_with_fixtures`
recwarn pytest 0.1.dev424+gcab02e6 recwarn.html :std:doc:`recwarn`
reference/customize pytest 0.1.dev424+gcab02e6 reference/customize.html Configuration :std:doc:`reference/customize`
reference/exit-codes pytest 0.1.dev424+gcab02e6 reference/exit-codes.html Exit codes :std:doc:`reference/exit-codes`
reference/fixtures pytest 0.1.dev424+gcab02e6 reference/fixtures.html Fixtures reference :std:doc:`reference/fixtures`
reference/index pytest 0.1.dev424+gcab02e6 reference/index.html Reference guides :std:doc:`reference/index`
reference/plugin_list pytest 0.1.dev424+gcab02e6 reference/plugin_list.html Plugin List :std:doc:`reference/plugin_list`
reference/reference pytest 0.1.dev424+gcab02e6 reference/reference.html API Reference :std:doc:`reference/reference`
sponsor pytest 0.1.dev424+gcab02e6 sponsor.html Sponsor :std:doc:`sponsor`
talks pytest 0.1.dev424+gcab02e6 talks.html Talks and Tutorials :std:doc:`talks`
tidelift pytest 0.1.dev424+gcab02e6 tidelift.html pytest for enterprise :std:doc:`tidelift`
yieldfixture pytest 0.1.dev424+gcab02e6 yieldfixture.html “yield_fixture” functions :std:doc:`yieldfixture`

std:fixture

Identifier Project Name Version Location Display Name Usage example
cache pytest 0.1.dev424+gcab02e6 reference/reference.html#std-fixture-cache - :std:fixture:`cache`
capfd pytest 0.1.dev424+gcab02e6 reference/reference.html#std-fixture-capfd - :std:fixture:`capfd`
capfdbinary pytest 0.1.dev424+gcab02e6 reference/reference.html#std-fixture-capfdbinary - :std:fixture:`capfdbinary`
caplog pytest 0.1.dev424+gcab02e6 reference/reference.html#std-fixture-caplog - :std:fixture:`caplog`
capsys pytest 0.1.dev424+gcab02e6 reference/reference.html#std-fixture-capsys - :std:fixture:`capsys`
capsysbinary pytest 0.1.dev424+gcab02e6 reference/reference.html#std-fixture-capsysbinary - :std:fixture:`capsysbinary`
doctest_namespace pytest 0.1.dev424+gcab02e6 reference/reference.html#std-fixture-doctest_namespace - :std:fixture:`doctest_namespace`
monkeypatch pytest 0.1.dev424+gcab02e6 reference/reference.html#std-fixture-monkeypatch - :std:fixture:`monkeypatch`
pytestconfig pytest 0.1.dev424+gcab02e6 reference/reference.html#std-fixture-pytestconfig - :std:fixture:`pytestconfig`
pytester pytest 0.1.dev424+gcab02e6 reference/reference.html#std-fixture-pytester - :std:fixture:`pytester`
record_property pytest 0.1.dev424+gcab02e6 reference/reference.html#std-fixture-record_property - :std:fixture:`record_property`
record_testsuite_property pytest 0.1.dev424+gcab02e6 reference/reference.html#std-fixture-record_testsuite_property - :std:fixture:`record_testsuite_property`
recwarn pytest 0.1.dev424+gcab02e6 reference/reference.html#std-fixture-recwarn - :std:fixture:`recwarn`
request pytest 0.1.dev424+gcab02e6 reference/reference.html#std-fixture-request - :std:fixture:`request`
testdir pytest 0.1.dev424+gcab02e6 reference/reference.html#std-fixture-testdir - :std:fixture:`testdir`
tmp_path pytest 0.1.dev424+gcab02e6 reference/reference.html#std-fixture-tmp_path - :std:fixture:`tmp_path`
tmp_path_factory pytest 0.1.dev424+gcab02e6 reference/reference.html#std-fixture-tmp_path_factory - :std:fixture:`tmp_path_factory`
tmpdir pytest 0.1.dev424+gcab02e6 reference/reference.html#std-fixture-tmpdir - :std:fixture:`tmpdir`
tmpdir_factory pytest 0.1.dev424+gcab02e6 reference/reference.html#std-fixture-tmpdir_factory - :std:fixture:`tmpdir_factory`

std:globalvar

Identifier Project Name Version Location Display Name Usage example
collect_ignore pytest 0.1.dev424+gcab02e6 reference/reference.html#globalvar-collect_ignore - :std:globalvar:`collect_ignore`
collect_ignore_glob pytest 0.1.dev424+gcab02e6 reference/reference.html#globalvar-collect_ignore_glob - :std:globalvar:`collect_ignore_glob`
pytest_plugins pytest 0.1.dev424+gcab02e6 reference/reference.html#globalvar-pytest_plugins - :std:globalvar:`pytest_plugins`
pytestmark pytest 0.1.dev424+gcab02e6 reference/reference.html#globalvar-pytestmark - :std:globalvar:`pytestmark`

std:hook

Identifier Project Name Version Location Display Name Usage example
pytest_addhooks pytest 0.1.dev424+gcab02e6 reference/reference.html#std-hook-pytest_addhooks - :std:hook:`pytest_addhooks`
pytest_addoption pytest 0.1.dev424+gcab02e6 reference/reference.html#std-hook-pytest_addoption - :std:hook:`pytest_addoption`
pytest_assertion_pass pytest 0.1.dev424+gcab02e6 reference/reference.html#std-hook-pytest_assertion_pass - :std:hook:`pytest_assertion_pass`
pytest_assertrepr_compare pytest 0.1.dev424+gcab02e6 reference/reference.html#std-hook-pytest_assertrepr_compare - :std:hook:`pytest_assertrepr_compare`
pytest_cmdline_main pytest 0.1.dev424+gcab02e6 reference/reference.html#std-hook-pytest_cmdline_main - :std:hook:`pytest_cmdline_main`
pytest_cmdline_parse pytest 0.1.dev424+gcab02e6 reference/reference.html#std-hook-pytest_cmdline_parse - :std:hook:`pytest_cmdline_parse`
pytest_cmdline_preparse pytest 0.1.dev424+gcab02e6 reference/reference.html#std-hook-pytest_cmdline_preparse - :std:hook:`pytest_cmdline_preparse`
pytest_collect_file pytest 0.1.dev424+gcab02e6 reference/reference.html#std-hook-pytest_collect_file - :std:hook:`pytest_collect_file`
pytest_collection pytest 0.1.dev424+gcab02e6 reference/reference.html#std-hook-pytest_collection - :std:hook:`pytest_collection`
pytest_collection_modifyitems pytest 0.1.dev424+gcab02e6 reference/reference.html#std-hook-pytest_collection_modifyitems - :std:hook:`pytest_collection_modifyitems`
pytest_collectreport pytest 0.1.dev424+gcab02e6 reference/reference.html#std-hook-pytest_collectreport - :std:hook:`pytest_collectreport`
pytest_collectstart pytest 0.1.dev424+gcab02e6 reference/reference.html#std-hook-pytest_collectstart - :std:hook:`pytest_collectstart`
pytest_configure pytest 0.1.dev424+gcab02e6 reference/reference.html#std-hook-pytest_configure - :std:hook:`pytest_configure`
pytest_deselected pytest 0.1.dev424+gcab02e6 reference/reference.html#std-hook-pytest_deselected - :std:hook:`pytest_deselected`
pytest_enter_pdb pytest 0.1.dev424+gcab02e6 reference/reference.html#std-hook-pytest_enter_pdb - :std:hook:`pytest_enter_pdb`
pytest_exception_interact pytest 0.1.dev424+gcab02e6 reference/reference.html#std-hook-pytest_exception_interact - :std:hook:`pytest_exception_interact`
pytest_fixture_post_finalizer pytest 0.1.dev424+gcab02e6 reference/reference.html#std-hook-pytest_fixture_post_finalizer - :std:hook:`pytest_fixture_post_finalizer`
pytest_fixture_setup pytest 0.1.dev424+gcab02e6 reference/reference.html#std-hook-pytest_fixture_setup - :std:hook:`pytest_fixture_setup`
pytest_generate_tests pytest 0.1.dev424+gcab02e6 reference/reference.html#std-hook-pytest_generate_tests - :std:hook:`pytest_generate_tests`
pytest_ignore_collect pytest 0.1.dev424+gcab02e6 reference/reference.html#std-hook-pytest_ignore_collect - :std:hook:`pytest_ignore_collect`
pytest_internalerror pytest 0.1.dev424+gcab02e6 reference/reference.html#std-hook-pytest_internalerror - :std:hook:`pytest_internalerror`
pytest_itemcollected pytest 0.1.dev424+gcab02e6 reference/reference.html#std-hook-pytest_itemcollected - :std:hook:`pytest_itemcollected`
pytest_keyboard_interrupt pytest 0.1.dev424+gcab02e6 reference/reference.html#std-hook-pytest_keyboard_interrupt - :std:hook:`pytest_keyboard_interrupt`
pytest_leave_pdb pytest 0.1.dev424+gcab02e6 reference/reference.html#std-hook-pytest_leave_pdb - :std:hook:`pytest_leave_pdb`
pytest_load_initial_conftests pytest 0.1.dev424+gcab02e6 reference/reference.html#std-hook-pytest_load_initial_conftests - :std:hook:`pytest_load_initial_conftests`
pytest_make_collect_report pytest 0.1.dev424+gcab02e6 reference/reference.html#std-hook-pytest_make_collect_report - :std:hook:`pytest_make_collect_report`
pytest_make_parametrize_id pytest 0.1.dev424+gcab02e6 reference/reference.html#std-hook-pytest_make_parametrize_id - :std:hook:`pytest_make_parametrize_id`
pytest_markeval_namespace pytest 0.1.dev424+gcab02e6 reference/reference.html#std-hook-pytest_markeval_namespace - :std:hook:`pytest_markeval_namespace`
pytest_plugin_registered pytest 0.1.dev424+gcab02e6 reference/reference.html#std-hook-pytest_plugin_registered - :std:hook:`pytest_plugin_registered`
pytest_pycollect_makeitem pytest 0.1.dev424+gcab02e6 reference/reference.html#std-hook-pytest_pycollect_makeitem - :std:hook:`pytest_pycollect_makeitem`
pytest_pycollect_makemodule pytest 0.1.dev424+gcab02e6 reference/reference.html#std-hook-pytest_pycollect_makemodule - :std:hook:`pytest_pycollect_makemodule`
pytest_pyfunc_call pytest 0.1.dev424+gcab02e6 reference/reference.html#std-hook-pytest_pyfunc_call - :std:hook:`pytest_pyfunc_call`
pytest_report_collectionfinish pytest 0.1.dev424+gcab02e6 reference/reference.html#std-hook-pytest_report_collectionfinish - :std:hook:`pytest_report_collectionfinish`
pytest_report_from_serializable pytest 0.1.dev424+gcab02e6 reference/reference.html#std-hook-pytest_report_from_serializable - :std:hook:`pytest_report_from_serializable`
pytest_report_header pytest 0.1.dev424+gcab02e6 reference/reference.html#std-hook-pytest_report_header - :std:hook:`pytest_report_header`
pytest_report_teststatus pytest 0.1.dev424+gcab02e6 reference/reference.html#std-hook-pytest_report_teststatus - :std:hook:`pytest_report_teststatus`
pytest_report_to_serializable pytest 0.1.dev424+gcab02e6 reference/reference.html#std-hook-pytest_report_to_serializable - :std:hook:`pytest_report_to_serializable`
pytest_runtest_call pytest 0.1.dev424+gcab02e6 reference/reference.html#std-hook-pytest_runtest_call - :std:hook:`pytest_runtest_call`
pytest_runtest_logfinish pytest 0.1.dev424+gcab02e6 reference/reference.html#std-hook-pytest_runtest_logfinish - :std:hook:`pytest_runtest_logfinish`
pytest_runtest_logreport pytest 0.1.dev424+gcab02e6 reference/reference.html#std-hook-pytest_runtest_logreport - :std:hook:`pytest_runtest_logreport`
pytest_runtest_logstart pytest 0.1.dev424+gcab02e6 reference/reference.html#std-hook-pytest_runtest_logstart - :std:hook:`pytest_runtest_logstart`
pytest_runtest_makereport pytest 0.1.dev424+gcab02e6 reference/reference.html#std-hook-pytest_runtest_makereport - :std:hook:`pytest_runtest_makereport`
pytest_runtest_protocol pytest 0.1.dev424+gcab02e6 reference/reference.html#std-hook-pytest_runtest_protocol - :std:hook:`pytest_runtest_protocol`
pytest_runtest_setup pytest 0.1.dev424+gcab02e6 reference/reference.html#std-hook-pytest_runtest_setup - :std:hook:`pytest_runtest_setup`
pytest_runtest_teardown pytest 0.1.dev424+gcab02e6 reference/reference.html#std-hook-pytest_runtest_teardown - :std:hook:`pytest_runtest_teardown`
pytest_runtestloop pytest 0.1.dev424+gcab02e6 reference/reference.html#std-hook-pytest_runtestloop - :std:hook:`pytest_runtestloop`
pytest_sessionfinish pytest 0.1.dev424+gcab02e6 reference/reference.html#std-hook-pytest_sessionfinish - :std:hook:`pytest_sessionfinish`
pytest_sessionstart pytest 0.1.dev424+gcab02e6 reference/reference.html#std-hook-pytest_sessionstart - :std:hook:`pytest_sessionstart`
pytest_terminal_summary pytest 0.1.dev424+gcab02e6 reference/reference.html#std-hook-pytest_terminal_summary - :std:hook:`pytest_terminal_summary`
pytest_unconfigure pytest 0.1.dev424+gcab02e6 reference/reference.html#std-hook-pytest_unconfigure - :std:hook:`pytest_unconfigure`
pytest_warning_recorded pytest 0.1.dev424+gcab02e6 reference/reference.html#std-hook-pytest_warning_recorded - :std:hook:`pytest_warning_recorded`